﻿2026-08-17T23:34:23.9503551Z Current runner version: '2.336.0'
2026-08-17T23:34:23.9508428Z Runner name: 'hfenduleam'
2026-08-17T23:34:23.9508910Z Runner group name: 'Default'
2026-08-17T23:34:23.9509398Z Machine name: 'HFENDULEAM'
2026-08-17T23:34:23.9512577Z ##[group]GITHUB_TOKEN Permissions
2026-08-17T23:34:23.9514011Z Actions: write
2026-08-17T23:34:23.9514353Z ArtifactMetadata: write
2026-08-17T23:34:23.9514695Z Attestations: write
2026-08-17T23:34:23.9515036Z Checks: write
2026-08-17T23:34:23.9515337Z CodeQuality: write
2026-08-17T23:34:23.9515655Z Contents: write
2026-08-17T23:34:23.9515983Z CopilotRequests: write
2026-08-17T23:34:23.9516360Z Deployments: write
2026-08-17T23:34:23.9516760Z Discussions: write
2026-08-17T23:34:23.9517073Z Drives: write
2026-08-17T23:34:23.9517364Z Issues: write
2026-08-17T23:34:23.9517681Z Metadata: read
2026-08-17T23:34:23.9517986Z Models: read
2026-08-17T23:34:23.9518281Z Packages: write
2026-08-17T23:34:23.9518592Z Pages: write
2026-08-17T23:34:23.9519098Z PullRequests: write
2026-08-17T23:34:23.9519492Z RepositoryProjects: write
2026-08-17T23:34:23.9519838Z SecurityEvents: write
2026-08-17T23:34:23.9520165Z Statuses: write
2026-08-17T23:34:23.9520476Z VulnerabilityAlerts: read
2026-08-17T23:34:23.9520823Z ##[endgroup]
2026-08-17T23:34:23.9522087Z Secret source: Actions
2026-08-17T23:34:23.9522655Z Prepare workflow directory
2026-08-17T23:34:23.9827361Z Prepare all required actions
2026-08-17T23:34:23.9858428Z Getting action download info
2026-08-17T23:34:24.3338089Z Download action repository 'actions/checkout@v5' (SHA:fbc6f3992d24b796d5a048ff273f7fcc4a7b6c09)
2026-08-17T23:34:24.7739789Z Complete job name: unit (self-hosted, Windows, hfenduleam)
2026-08-17T23:34:24.8821770Z ##[group]Run $floorBytes = 32GB
2026-08-17T23:34:24.8822310Z [36;1m$floorBytes = 32GB[0m
2026-08-17T23:34:24.8822748Z [36;1m$drive = (Get-Item $env:GITHUB_WORKSPACE).PSDrive[0m
2026-08-17T23:34:24.8823209Z [36;1m$freeBytes = [int64]$drive.Free[0m
2026-08-17T23:34:24.8823846Z [36;1mWrite-Host "disk preflight: drive=$($drive.Root) free_bytes=$freeBytes floor_bytes=$floorBytes"[0m
2026-08-17T23:34:24.8824486Z [36;1mif ($freeBytes -lt $floorBytes) {[0m
2026-08-17T23:34:24.8825082Z [36;1m  Write-Error "RESOURCE=disk drive=$($drive.Root) free_bytes=$freeBytes floor_bytes=$floorBytes"[0m
2026-08-17T23:34:24.8825684Z [36;1m  exit 1[0m
2026-08-17T23:34:24.8825972Z [36;1m}[0m
2026-08-17T23:34:24.8833999Z shell: C:\Program Files\PowerShell\7\pwsh.EXE -command ". '{0}'"
2026-08-17T23:34:24.8834635Z ##[endgroup]
2026-08-17T23:34:25.1639852Z disk preflight: drive=C:\ free_bytes=147442216960 floor_bytes=34359738368
2026-08-17T23:34:25.2417279Z ##[group]Run actions/checkout@v5
2026-08-17T23:34:25.2417756Z with:
2026-08-17T23:34:25.2418079Z   repository: BigscreenVR/spt-bs-core
2026-08-17T23:34:25.2420685Z   token: ***
2026-08-17T23:34:25.2420972Z   ssh-strict: true
2026-08-17T23:34:25.2421282Z   ssh-user: git
2026-08-17T23:34:25.2421580Z   persist-credentials: true
2026-08-17T23:34:25.2421923Z   clean: true
2026-08-17T23:34:25.2422230Z   sparse-checkout-cone-mode: true
2026-08-17T23:34:25.2422579Z   fetch-depth: 1
2026-08-17T23:34:25.2422891Z   fetch-tags: false
2026-08-17T23:34:25.2423191Z   show-progress: true
2026-08-17T23:34:25.2423482Z   lfs: false
2026-08-17T23:34:25.2423775Z   submodules: false
2026-08-17T23:34:25.2424079Z   set-safe-directory: true
2026-08-17T23:34:25.2424416Z   allow-unsafe-pr-checkout: false
2026-08-17T23:34:25.2424767Z ##[endgroup]
2026-08-17T23:34:25.4489701Z Syncing repository: BigscreenVR/spt-bs-core
2026-08-17T23:34:25.4491553Z ##[group]Getting Git version info
2026-08-17T23:34:25.4492427Z Working directory is 'C:\actions-runner\_work\spt-bs-core\spt-bs-core'
2026-08-17T23:34:25.4829721Z [command]"C:\Program Files\Git\cmd\git.exe" version
2026-08-17T23:34:25.5039547Z git version 2.43.0.windows.1
2026-08-17T23:34:25.5062246Z ##[endgroup]
2026-08-17T23:34:25.5069997Z Copying 'C:\Users\decid\.gitconfig' to 'C:\actions-runner\_work\_temp\6776d0b4-6576-4983-9f1a-8f28a0cba4a4\.gitconfig'
2026-08-17T23:34:25.5083107Z Temporarily overriding HOME='C:\actions-runner\_work\_temp\6776d0b4-6576-4983-9f1a-8f28a0cba4a4' before making global git config changes
2026-08-17T23:34:25.5084050Z Adding repository directory to the temporary git global config as a safe directory
2026-08-17T23:34:25.5088641Z [command]"C:\Program Files\Git\cmd\git.exe" config --global --add safe.directory C:\actions-runner\_work\spt-bs-core\spt-bs-core
2026-08-17T23:34:25.5358112Z [command]"C:\Program Files\Git\cmd\git.exe" config --local --get remote.origin.url
2026-08-17T23:34:25.5567481Z https://github.com/BigscreenVR/spt-bs-core
2026-08-17T23:34:25.5591603Z ##[group]Removing previously created refs, to avoid conflicts
2026-08-17T23:34:25.5596202Z [command]"C:\Program Files\Git\cmd\git.exe" rev-parse --symbolic-full-name --verify --quiet HEAD
2026-08-17T23:34:25.5809426Z HEAD
2026-08-17T23:34:25.6138115Z ##[endgroup]
2026-08-17T23:34:25.6141761Z [command]"C:\Program Files\Git\cmd\git.exe" submodule status
2026-08-17T23:34:26.0915543Z ##[group]Cleaning the repository
2026-08-17T23:34:26.0919978Z [command]"C:\Program Files\Git\cmd\git.exe" clean -ffdx
2026-08-17T23:34:29.9905810Z Removing target/
2026-08-17T23:34:29.9940472Z [command]"C:\Program Files\Git\cmd\git.exe" reset --hard HEAD
2026-08-17T23:34:30.2040689Z HEAD is now at cc7baeab1 Merge a70ca2d872fb80cb0a7671ed39d71df065d4c80d into 27d40b9a4467c0f04649cb46734b0c76596ed605
2026-08-17T23:34:30.2075392Z ##[endgroup]
2026-08-17T23:34:30.2081156Z ##[group]Disabling automatic garbage collection
2026-08-17T23:34:30.2088628Z [command]"C:\Program Files\Git\cmd\git.exe" config --local gc.auto 0
2026-08-17T23:34:30.2457374Z ##[endgroup]
2026-08-17T23:34:30.2458508Z ##[group]Setting up auth
2026-08-17T23:34:30.2463912Z [command]"C:\Program Files\Git\cmd\git.exe" config --local --name-only --get-regexp core\.sshCommand
2026-08-17T23:34:30.3171716Z [command]"C:\Program Files\Git\cmd\git.exe" submodule foreach --recursive "sh -c \"git config --local --name-only --get-regexp 'core\.sshCommand' && git config --local --unset-all 'core.sshCommand' || :\""
2026-08-17T23:34:31.4351355Z [command]"C:\Program Files\Git\cmd\git.exe" config --local --name-only --get-regexp http\.https\:\/\/github\.com\/\.extraheader
2026-08-17T23:34:31.4613042Z [command]"C:\Program Files\Git\cmd\git.exe" submodule foreach --recursive "sh -c \"git config --local --name-only --get-regexp 'http\.https\:\/\/github\.com\/\.extraheader' && git config --local --unset-all 'http.https://github.com/.extraheader' || :\""
2026-08-17T23:34:31.9872427Z [command]"C:\Program Files\Git\cmd\git.exe" config --local --name-only --get-regexp ^includeIf\.gitdir:
2026-08-17T23:34:32.0144145Z [command]"C:\Program Files\Git\cmd\git.exe" submodule foreach --recursive "git config --local --show-origin --name-only --get-regexp remote.origin.url"
2026-08-17T23:34:32.5362420Z [command]"C:\Program Files\Git\cmd\git.exe" config --local http.https://github.com/.extraheader "AUTHORIZATION: basic ***"
2026-08-17T23:34:32.6141165Z ##[endgroup]
2026-08-17T23:34:32.6141849Z ##[group]Fetching the repository
2026-08-17T23:34:32.6151126Z [command]"C:\Program Files\Git\cmd\git.exe" -c protocol.version=2 fetch --no-tags --prune --no-recurse-submodules --depth=1 origin +5018337ee872e1ae8be92dd52e583b70ec5106e9:refs/remotes/pull/145/merge
2026-08-17T23:34:33.5873110Z From https://github.com/BigscreenVR/spt-bs-core
2026-08-17T23:34:33.5873667Z  + cc7baeab1...5018337ee 5018337ee872e1ae8be92dd52e583b70ec5106e9 -> pull/145/merge  (forced update)
2026-08-17T23:34:33.6016325Z ##[endgroup]
2026-08-17T23:34:33.6016897Z ##[group]Determining the checkout info
2026-08-17T23:34:33.6017564Z ##[endgroup]
2026-08-17T23:34:33.6023550Z [command]"C:\Program Files\Git\cmd\git.exe" sparse-checkout disable
2026-08-17T23:34:33.6333040Z [command]"C:\Program Files\Git\cmd\git.exe" config --local --unset-all extensions.worktreeConfig
2026-08-17T23:34:33.6593212Z ##[group]Checking out the ref
2026-08-17T23:34:33.6598524Z [command]"C:\Program Files\Git\cmd\git.exe" checkout --progress --force refs/remotes/pull/145/merge
2026-08-17T23:34:33.8292588Z Warning: you are leaving 1 commit behind, not connected to
2026-08-17T23:34:33.8293156Z any of your branches:
2026-08-17T23:34:33.8293324Z 
2026-08-17T23:34:33.8293728Z   cc7baeab1 Merge a70ca2d872fb80cb0a7671ed39d71df065d4c80d into 27d40b9a4467c0f04649cb46734b0c76596ed605
2026-08-17T23:34:33.8294224Z 
2026-08-17T23:34:33.8294431Z If you want to keep it by creating a new branch, this may be a good time
2026-08-17T23:34:33.8294875Z to do so with:
2026-08-17T23:34:33.8295031Z 
2026-08-17T23:34:33.8295186Z  git branch <new-branch-name> cc7baeab1
2026-08-17T23:34:33.8295419Z 
2026-08-17T23:34:33.8295797Z HEAD is now at 5018337ee Merge fa8c22293a8345d14455255e7de34d1d73e6ca57 into 27d40b9a4467c0f04649cb46734b0c76596ed605
2026-08-17T23:34:33.8322391Z ##[endgroup]
2026-08-17T23:34:33.8641037Z [command]"C:\Program Files\Git\cmd\git.exe" log -1 --format=%H
2026-08-17T23:34:33.8913317Z 5018337ee872e1ae8be92dd52e583b70ec5106e9
2026-08-17T23:34:33.9186877Z ##[group]Run cargo build -p spt --bin translate_proof_fixture
2026-08-17T23:34:33.9187314Z [36;1mcargo build -p spt --bin translate_proof_fixture[0m
2026-08-17T23:34:33.9191994Z shell: C:\Program Files\PowerShell\7\pwsh.EXE -command ". '{0}'"
2026-08-17T23:34:33.9192281Z ##[endgroup]
2026-08-17T23:34:34.8308811Z    Compiling proc-macro2 v1.0.106
2026-08-17T23:34:34.8309207Z    Compiling unicode-ident v1.0.24
2026-08-17T23:34:34.8309476Z    Compiling quote v1.0.45
2026-08-17T23:34:34.8309720Z    Compiling cfg-if v1.0.4
2026-08-17T23:34:34.8938200Z    Compiling serde_core v1.0.228
2026-08-17T23:34:34.9128970Z    Compiling serde v1.0.228
2026-08-17T23:34:35.1679344Z    Compiling windows-link v0.2.1
2026-08-17T23:34:35.2474585Z    Compiling typenum v1.20.1
2026-08-17T23:34:35.2783031Z    Compiling windows-sys v0.61.2
2026-08-17T23:34:35.9920772Z    Compiling getrandom v0.3.4
2026-08-17T23:34:36.0991559Z    Compiling syn v2.0.117
2026-08-17T23:34:36.3644643Z    Compiling portable-atomic v1.13.1
2026-08-17T23:34:37.2011056Z    Compiling version_check v0.9.5
2026-08-17T23:34:37.3401615Z    Compiling pin-project-lite v0.2.17
2026-08-17T23:34:37.6999974Z    Compiling jobserver v0.1.34
2026-08-17T23:34:37.7404131Z    Compiling find-msvc-tools v0.1.9
2026-08-17T23:34:37.9654396Z    Compiling memchr v2.8.1
2026-08-17T23:34:38.4494586Z    Compiling shlex v2.0.1
2026-08-17T23:34:38.5866283Z    Compiling cc v1.2.63
2026-08-17T23:34:38.6382070Z    Compiling critical-section v1.2.0
2026-08-17T23:34:38.7130255Z    Compiling subtle v2.6.1
2026-08-17T23:34:38.8182120Z    Compiling futures-core v0.3.32
2026-08-17T23:34:38.9271417Z    Compiling equivalent v1.0.2
2026-08-17T23:34:38.9848426Z    Compiling smallvec v1.15.1
2026-08-17T23:34:39.1358566Z    Compiling generic-array v0.14.7
2026-08-17T23:34:39.3768072Z    Compiling bytes v1.11.1
2026-08-17T23:34:39.9315950Z    Compiling itoa v1.0.18
2026-08-17T23:34:40.0720030Z    Compiling semver v1.0.28
2026-08-17T23:34:40.3347518Z    Compiling rustc_version v0.4.1
2026-08-17T23:34:40.5787721Z    Compiling synstructure v0.13.2
2026-08-17T23:34:40.6048716Z    Compiling stable_deref_trait v1.2.1
2026-08-17T23:34:40.6415862Z    Compiling serde_derive v1.0.228
2026-08-17T23:34:40.6655594Z    Compiling zeroize_derive v1.4.3
2026-08-17T23:34:41.0710307Z    Compiling socket2 v0.6.4
2026-08-17T23:34:41.0919322Z    Compiling zeroize v1.8.2
2026-08-17T23:34:41.3269822Z    Compiling log v0.4.32
2026-08-17T23:34:41.4686972Z    Compiling zerofrom-derive v0.1.7
2026-08-17T23:34:41.5321868Z    Compiling yoke-derive v0.8.2
2026-08-17T23:34:42.5554036Z    Compiling mio v1.2.1
2026-08-17T23:34:42.7043654Z    Compiling tokio-macros v2.7.0
2026-08-17T23:34:42.7179437Z    Compiling zerofrom v0.1.8
2026-08-17T23:34:42.9522388Z    Compiling crypto-common v0.1.7
2026-08-17T23:34:43.0360621Z    Compiling slab v0.4.12
2026-08-17T23:34:43.1652077Z    Compiling futures-io v0.3.32
2026-08-17T23:34:43.2299507Z    Compiling futures-sink v0.3.32
2026-08-17T23:34:43.3146616Z    Compiling futures-channel v0.3.32
2026-08-17T23:34:43.3258885Z    Compiling tokio v1.52.3
2026-08-17T23:34:43.3945970Z    Compiling yoke v0.8.3
2026-08-17T23:34:43.6165975Z    Compiling futures-macro v0.3.32
2026-08-17T23:34:43.6655606Z    Compiling hashbrown v0.17.1
2026-08-17T23:34:43.9013832Z    Compiling once_cell v1.21.4
2026-08-17T23:34:44.0642614Z    Compiling rustversion v1.0.22
2026-08-17T23:34:44.1375889Z    Compiling rand_core v0.10.1
2026-08-17T23:34:44.2316804Z    Compiling futures-task v0.3.32
2026-08-17T23:34:44.2616243Z    Compiling indexmap v2.14.0
2026-08-17T23:34:44.4069026Z    Compiling futures-util v0.3.32
2026-08-17T23:34:44.5576941Z    Compiling zerovec-derive v0.11.3
2026-08-17T23:34:44.7873491Z    Compiling getrandom v0.2.17
2026-08-17T23:34:44.9270698Z    Compiling cpufeatures v0.2.17
2026-08-17T23:34:45.4933734Z    Compiling zerovec v0.11.6
2026-08-17T23:34:45.7754990Z    Compiling displaydoc v0.2.6
2026-08-17T23:34:46.0285553Z    Compiling hybrid-array v0.4.12
2026-08-17T23:34:46.3447332Z    Compiling fnv v1.0.7
2026-08-17T23:34:46.4407635Z    Compiling getrandom v0.4.2
2026-08-17T23:34:46.5194307Z    Compiling libc v0.2.186
2026-08-17T23:34:46.7057464Z    Compiling strsim v0.11.1
2026-08-17T23:34:46.9522568Z    Compiling cfg_aliases v0.2.1
2026-08-17T23:34:47.0075834Z    Compiling crypto-common v0.2.2
2026-08-17T23:34:47.1526422Z    Compiling block-buffer v0.12.0
2026-08-17T23:34:47.1974881Z    Compiling tinystr v0.8.3
2026-08-17T23:34:47.2780408Z    Compiling tracing-core v0.1.36
2026-08-17T23:34:47.4980243Z    Compiling tracing-attributes v0.1.31
2026-08-17T23:34:47.8797397Z    Compiling litemap v0.8.2
2026-08-17T23:34:48.0324944Z    Compiling autocfg v1.5.1
2026-08-17T23:34:48.2068982Z    Compiling writeable v0.6.3
2026-08-17T23:34:48.3619028Z    Compiling icu_locale_core v2.2.0
2026-08-17T23:34:48.4124949Z    Compiling zerotrie v0.2.4
2026-08-17T23:34:48.6157584Z    Compiling tracing v0.1.44
2026-08-17T23:34:48.7329509Z    Compiling potential_utf v0.1.5
2026-08-17T23:34:48.8662089Z    Compiling cmake v0.1.58
2026-08-17T23:34:49.0598539Z    Compiling icu_properties_data v2.2.0
2026-08-17T23:34:49.2207357Z    Compiling fs_extra v1.3.0
2026-08-17T23:34:49.2692148Z    Compiling utf8_iter v1.0.4
2026-08-17T23:34:49.4154549Z    Compiling icu_normalizer_data v2.2.0
2026-08-17T23:34:49.4775175Z    Compiling ident_case v1.0.1
2026-08-17T23:34:49.5516609Z    Compiling dunce v1.0.5
2026-08-17T23:34:49.6421627Z    Compiling icu_collections v2.2.0
2026-08-17T23:34:49.6604221Z    Compiling aws-lc-sys v0.41.0
2026-08-17T23:34:49.7454544Z    Compiling icu_provider v2.2.0
2026-08-17T23:34:49.7520265Z    Compiling tokio-util v0.7.18
2026-08-17T23:34:50.1700830Z    Compiling percent-encoding v2.3.2
2026-08-17T23:34:50.2193208Z    Compiling icu_normalizer v2.2.0
2026-08-17T23:34:50.3331517Z    Compiling icu_properties v2.2.0
2026-08-17T23:34:50.7857965Z    Compiling inout v0.2.2
2026-08-17T23:34:50.8766238Z    Compiling http v1.4.1
2026-08-17T23:34:50.8865706Z    Compiling ring v0.17.14
2026-08-17T23:34:51.3624168Z    Compiling thiserror v2.0.18
2026-08-17T23:34:51.4665726Z    Compiling unicode-segmentation v1.13.3
2026-08-17T23:34:51.6477756Z    Compiling cpufeatures v0.3.0
2026-08-17T23:34:51.7382639Z    Compiling aws-lc-rs v1.17.0
2026-08-17T23:34:51.9771601Z    Compiling idna_adapter v1.2.2
2026-08-17T23:34:52.0356640Z    Compiling cipher v0.5.2
2026-08-17T23:34:52.1376908Z    Compiling curve25519-dalek-derive v0.1.1
2026-08-17T23:34:52.2735362Z    Compiling thiserror-impl v2.0.18
2026-08-17T23:34:52.8143762Z    Compiling scopeguard v1.2.0
2026-08-17T23:34:52.8921565Z    Compiling lock_api v0.4.14
2026-08-17T23:34:53.1299301Z    Compiling chacha20 v0.10.0
2026-08-17T23:34:53.3423725Z    Compiling idna v1.1.0
2026-08-17T23:34:53.5365317Z    Compiling form_urlencoded v1.2.2
2026-08-17T23:34:53.7131048Z    Compiling ipnet v2.12.0
2026-08-17T23:34:54.1344560Z    Compiling rustls-pki-types v1.14.1
2026-08-17T23:34:54.2600543Z    Compiling block-buffer v0.10.4
2026-08-17T23:34:54.3520236Z    Compiling bitflags v2.12.1
2026-08-17T23:34:54.4403591Z    Compiling winapi v0.3.9
2026-08-17T23:34:54.5253347Z    Compiling untrusted v0.9.0
2026-08-17T23:34:54.5980089Z    Compiling digest v0.10.7
2026-08-17T23:34:54.7837715Z    Compiling url v2.5.8
2026-08-17T23:34:54.8832653Z    Compiling rand v0.10.1
2026-08-17T23:34:55.4136934Z    Compiling darling_core v0.20.11
2026-08-17T23:34:55.6043386Z    Compiling num-traits v0.2.19
2026-08-17T23:34:55.8585787Z    Compiling windows-result v0.4.1
2026-08-17T23:34:56.0973531Z    Compiling windows-strings v0.5.1
2026-08-17T23:34:56.3920457Z    Compiling heck v0.5.0
2026-08-17T23:34:56.5885514Z    Compiling rustls v0.23.40
2026-08-17T23:34:56.9191577Z    Compiling convert_case v0.10.0
2026-08-17T23:34:57.1582798Z    Compiling unicode-xid v0.2.6
2026-08-17T23:34:57.2399360Z    Compiling const-oid v0.10.2
2026-08-17T23:34:57.4143498Z    Compiling anyhow v1.0.102
2026-08-17T23:34:57.5900702Z    Compiling darling_macro v0.20.11
2026-08-17T23:34:57.7105201Z    Compiling atomic-waker v1.1.2
2026-08-17T23:34:57.9099303Z    Compiling darling v0.20.11
2026-08-17T23:34:58.1179073Z    Compiling derive_more-impl v2.1.1
2026-08-17T23:34:58.3187687Z    Compiling zerocopy v0.8.50
2026-08-17T23:34:58.7976293Z    Compiling parking_lot_core v0.9.12
2026-08-17T23:34:58.9231321Z    Compiling httparse v1.10.1
2026-08-17T23:34:59.1846360Z    Compiling derive_builder_core v0.20.2
2026-08-17T23:34:59.7808518Z    Compiling h2 v0.4.14
2026-08-17T23:34:59.9253732Z    Compiling http-body v1.0.1
2026-08-17T23:35:00.0233479Z    Compiling curve25519-dalek v4.1.3
2026-08-17T23:35:00.2457392Z    Compiling ahash v0.8.12
2026-08-17T23:35:00.4314003Z    Compiling base64ct v1.8.3
2026-08-17T23:35:00.6322140Z    Compiling powerfmt v0.2.0
2026-08-17T23:35:00.7794136Z    Compiling either v1.16.0
2026-08-17T23:35:00.8808487Z    Compiling derive_more v2.1.1
2026-08-17T23:35:00.9459554Z    Compiling deranged v0.5.8
2026-08-17T23:35:01.1806583Z    Compiling pem-rfc7468 v1.0.0
2026-08-17T23:35:01.6860108Z    Compiling derive_builder_macro v0.20.2
2026-08-17T23:35:02.3937021Z    Compiling uuid v1.23.2
2026-08-17T23:35:02.8640158Z    Compiling rand_core v0.6.4
2026-08-17T23:35:03.0564900Z    Compiling windows-interface v0.59.3
2026-08-17T23:35:03.7047856Z    Compiling n0-error-macros v0.1.3
2026-08-17T23:35:03.9157378Z    Compiling windows-implement v0.60.2
2026-08-17T23:35:04.4422438Z    Compiling spez v0.1.2
2026-08-17T23:35:04.4928246Z    Compiling zmij v1.0.21
2026-08-17T23:35:04.7350264Z    Compiling data-encoding v2.11.0
2026-08-17T23:35:04.8482718Z    Compiling fastrand v2.4.1
2026-08-17T23:35:04.9442179Z    Compiling try-lock v0.2.5
2026-08-17T23:35:05.0160093Z    Compiling base64 v0.22.1
2026-08-17T23:35:05.0224890Z    Compiling num-conv v0.2.2
2026-08-17T23:35:05.1318035Z    Compiling vcpkg v0.2.15
2026-08-17T23:35:05.3037334Z    Compiling time-core v0.1.8
2026-08-17T23:35:05.4232905Z    Compiling pkg-config v0.3.33
2026-08-17T23:35:05.6253136Z    Compiling tower-service v0.3.3
2026-08-17T23:35:05.6886712Z    Compiling tinyvec_macros v0.1.1
2026-08-17T23:35:05.7398333Z    Compiling tinyvec v1.11.0
2026-08-17T23:35:05.7429072Z    Compiling want v0.3.1
2026-08-17T23:35:05.8588902Z    Compiling n0-error v0.1.3
2026-08-17T23:35:05.8627308Z    Compiling libsqlite3-sys v0.30.1
2026-08-17T23:35:06.2060873Z    Compiling windows-core v0.62.2
2026-08-17T23:35:06.3677473Z    Compiling parking_lot v0.12.5
2026-08-17T23:35:06.8019678Z    Compiling derive_builder v0.20.2
2026-08-17T23:35:06.8432904Z    Compiling der v0.8.0-rc.10
2026-08-17T23:35:07.0000078Z    Compiling sha2 v0.10.9
2026-08-17T23:35:07.3349772Z    Compiling n0-future v0.3.2
2026-08-17T23:35:07.5214819Z    Compiling vergen-lib v9.1.0
2026-08-17T23:35:07.5789305Z    Compiling pin-project-internal v1.1.13
2026-08-17T23:35:07.7541601Z    Compiling inout v0.1.4
2026-08-17T23:35:07.8828145Z    Compiling spin v0.10.0
2026-08-17T23:35:07.9583899Z    Compiling crossbeam-utils v0.8.21
2026-08-17T23:35:08.0972066Z    Compiling parking v2.2.1
2026-08-17T23:35:08.2423490Z    Compiling spt-procident v0.55.0 (C:\actions-runner\_work\spt-bs-core\spt-bs-core\crates\spt-procident)
2026-08-17T23:35:08.2857097Z    Compiling winnow v1.0.3
2026-08-17T23:35:08.3782872Z    Compiling cordyceps v0.3.4
2026-08-17T23:35:08.4930293Z    Compiling diatomic-waker v0.2.3
2026-08-17T23:35:08.5828909Z    Compiling serde_json v1.0.150
2026-08-17T23:35:08.6196836Z    Compiling httpdate v1.0.3
2026-08-17T23:35:08.7482354Z    Compiling signature v2.2.0
2026-08-17T23:35:08.8177032Z    Compiling windows_x86_64_msvc v0.52.6
2026-08-17T23:35:08.8392588Z    Compiling ed25519 v2.2.3
2026-08-17T23:35:09.0257045Z    Compiling toml_parser v1.1.2+spec-1.1.0
2026-08-17T23:35:09.0749420Z    Compiling hyper v1.10.1
2026-08-17T23:35:09.1423528Z    Compiling futures-buffered v0.2.13
2026-08-17T23:35:09.4014361Z    Compiling pin-project v1.1.13
2026-08-17T23:35:09.5794647Z    Compiling spt-poolguard v0.55.0 (C:\actions-runner\_work\spt-bs-core\spt-bs-core\crates\spt-poolguard)
2026-08-17T23:35:09.6659168Z    Compiling futures-lite v2.6.1
2026-08-17T23:35:10.2368067Z    Compiling cipher v0.4.4
2026-08-17T23:35:10.3969656Z    Compiling spki v0.8.0-rc.4
2026-08-17T23:35:10.5356808Z    Compiling hashbrown v0.14.5
2026-08-17T23:35:10.9193586Z    Compiling digest v0.11.3
2026-08-17T23:35:10.9786256Z    Compiling noq-udp v0.10.0
2026-08-17T23:35:11.0361524Z    Compiling vergen v9.1.0
2026-08-17T23:35:11.1983933Z    Compiling vergen-lib v0.1.6
2026-08-17T23:35:11.2772523Z    Compiling universal-hash v0.5.1
2026-08-17T23:35:11.3632539Z    Compiling curve25519-dalek v5.0.0-pre.6
2026-08-17T23:35:11.3775939Z    Compiling heapless v0.7.17
2026-08-17T23:35:11.5699941Z    Compiling sync_wrapper v1.0.2
2026-08-17T23:35:11.5709347Z    Compiling aho-corasick v1.1.4
2026-08-17T23:35:11.6425846Z    Compiling byteorder v1.5.0
2026-08-17T23:35:11.7691100Z    Compiling toml_datetime v1.1.1+spec-1.1.0
2026-08-17T23:35:11.9520339Z    Compiling opaque-debug v0.3.1
2026-08-17T23:35:12.0012921Z    Compiling regex-syntax v0.8.10
2026-08-17T23:35:12.0097399Z    Compiling allocator-api2 v0.2.21
2026-08-17T23:35:12.4312031Z    Compiling polyval v0.6.2
2026-08-17T23:35:12.5912183Z    Compiling toml_edit v0.25.12+spec-1.1.0
2026-08-17T23:35:13.4496661Z    Compiling regex-automata v0.4.14
2026-08-17T23:35:13.6506259Z    Compiling hash32 v0.2.1
2026-08-17T23:35:14.5344243Z    Compiling hashlink v0.9.1
2026-08-17T23:35:14.7372044Z    Compiling pkcs8 v0.11.0-rc.10
2026-08-17T23:35:15.1909299Z    Compiling spt-store v0.55.0 (C:\actions-runner\_work\spt-bs-core\spt-bs-core\crates\spt-store)
2026-08-17T23:35:15.2236762Z    Compiling hyper-util v0.1.20
2026-08-17T23:35:15.8907839Z    Compiling ed25519-dalek v2.2.0
2026-08-17T23:35:16.1128098Z    Compiling prefix-trie v0.8.4
2026-08-17T23:35:16.5551764Z    Compiling spin v0.9.8
2026-08-17T23:35:16.6926484Z    Compiling futures-executor v0.3.32
2026-08-17T23:35:16.7422096Z    Compiling vergen-gitcl v1.0.8
2026-08-17T23:35:16.8959296Z    Compiling windows-threading v0.2.1
2026-08-17T23:35:16.9008903Z    Compiling ryu v1.0.23
2026-08-17T23:35:16.9464952Z    Compiling fallible-streaming-iterator v0.1.9
2026-08-17T23:35:16.9928892Z    Compiling signature v3.0.0
2026-08-17T23:35:17.0320179Z    Compiling fallible-iterator v0.3.0
2026-08-17T23:35:17.0950907Z    Compiling tower-layer v0.3.3
2026-08-17T23:35:17.2216688Z    Compiling ed25519 v3.0.0-rc.4
2026-08-17T23:35:17.2774607Z    Compiling rusqlite v0.32.1
2026-08-17T23:35:17.5382496Z    Compiling windows-future v0.3.2
2026-08-17T23:35:17.6038108Z    Compiling data-encoding-macro-internal v0.1.18
2026-08-17T23:35:18.0874032Z    Compiling futures v0.3.32
2026-08-17T23:35:18.2882515Z    Compiling hickory-proto v0.26.0-beta.4
2026-08-17T23:35:18.4239013Z    Compiling spt-proto v0.55.0 (C:\actions-runner\_work\spt-bs-core\spt-bs-core\crates\spt-proto)
2026-08-17T23:35:18.5399595Z    Compiling windows-targets v0.52.6
2026-08-17T23:35:18.6941129Z    Compiling regex v1.12.3
2026-08-17T23:35:19.6906110Z    Compiling proc-macro-crate v3.5.0
2026-08-17T23:35:20.1512450Z    Compiling ghash v0.5.1
2026-08-17T23:35:20.2665980Z    Compiling sha2 v0.11.0-rc.5
2026-08-17T23:35:20.8903269Z    Compiling aes v0.8.4
2026-08-17T23:35:21.0127873Z    Compiling ctr v0.9.2
2026-08-17T23:35:21.1363969Z    Compiling windows-collections v0.3.2
2026-08-17T23:35:21.3537582Z    Compiling windows-numerics v0.3.1
2026-08-17T23:35:21.4525130Z    Compiling time v0.3.47
2026-08-17T23:35:22.1565083Z    Compiling http-body-util v0.1.3
2026-08-17T23:35:22.3275963Z    Compiling fs2 v0.4.3
2026-08-17T23:35:22.4110132Z    Compiling cobs v0.3.0
2026-08-17T23:35:22.4697204Z    Compiling aead v0.5.2
2026-08-17T23:35:22.5615086Z    Compiling postcard-derive v0.2.2
2026-08-17T23:35:22.6033953Z    Compiling arrayvec v0.7.6
2026-08-17T23:35:22.7371781Z    Compiling ipconfig v0.3.4
2026-08-17T23:35:22.8918800Z    Compiling utf8parse v0.2.2
2026-08-17T23:35:22.9138623Z    Compiling widestring v1.2.1
2026-08-17T23:35:22.9663742Z    Compiling postcard v1.1.3
2026-08-17T23:35:23.4624634Z    Compiling aes-gcm v0.10.3
2026-08-17T23:35:23.7705152Z    Compiling windows v0.62.2
2026-08-17T23:35:23.8550328Z    Compiling ed25519-dalek v3.0.0-pre.6
2026-08-17T23:35:24.1204746Z    Compiling num_enum_derive v0.7.6
2026-08-17T23:35:24.8502336Z    Compiling windows-sys v0.59.0
2026-08-17T23:35:26.2447707Z    Compiling data-encoding-macro v0.1.20
2026-08-17T23:35:26.3805031Z    Compiling tower v0.5.3
2026-08-17T23:35:26.7672490Z    Compiling crossbeam-epoch v0.9.18
2026-08-17T23:35:27.1090409Z    Compiling crossbeam-channel v0.5.15
2026-08-17T23:35:27.6188967Z    Compiling chrono v0.4.45
2026-08-17T23:35:28.6695420Z    Compiling strum_macros v0.28.0
2026-08-17T23:35:30.1028414Z    Compiling iroh-metrics-derive v0.4.1
2026-08-17T23:35:30.4370416Z    Compiling windows-registry v0.6.1
2026-08-17T23:35:30.6670860Z    Compiling memoffset v0.6.5
2026-08-17T23:35:30.8486261Z    Compiling netwatch v0.16.0
2026-08-17T23:35:31.0585034Z    Compiling noq v0.18.0
2026-08-17T23:35:31.2844918Z    Compiling enum-assoc v1.3.0
2026-08-17T23:35:31.8233017Z    Compiling async-trait v0.1.89
2026-08-17T23:35:32.5554318Z    Compiling acto v0.8.2
2026-08-17T23:35:32.7086701Z    Compiling blake3 v1.8.5
2026-08-17T23:35:32.7568878Z    Compiling xml-rs v0.8.28
2026-08-17T23:35:33.3559440Z    Compiling sorted-index-buffer v0.2.1
2026-08-17T23:35:33.4505720Z    Compiling lru-slab v0.1.2
2026-08-17T23:35:33.5485115Z    Compiling ref-cast v1.0.25
2026-08-17T23:35:33.8102527Z    Compiling tagptr v0.2.0
2026-08-17T23:35:33.8480525Z    Compiling rustc-hash v2.1.2
2026-08-17T23:35:33.9119122Z    Compiling thiserror v1.0.69
2026-08-17T23:35:33.9227263Z    Compiling mac-addr v0.3.0
2026-08-17T23:35:34.0406911Z    Compiling foldhash v0.2.0
2026-08-17T23:35:34.1401024Z    Compiling identity-hash v0.1.0
2026-08-17T23:35:34.2208938Z    Compiling hashbrown v0.16.1
2026-08-17T23:35:34.2484793Z    Compiling netdev v0.42.0
2026-08-17T23:35:34.6666629Z    Compiling moka v0.12.15
2026-08-17T23:35:35.2495878Z    Compiling xmltree v0.10.3
2026-08-17T23:35:35.6822104Z    Compiling iroh-metrics v0.38.3
2026-08-17T23:35:35.6875656Z    Compiling wmi v0.18.4
2026-08-17T23:35:35.9406917Z    Compiling strum v0.28.0
2026-08-17T23:35:36.1269168Z    Compiling tower-http v0.6.11
2026-08-17T23:35:36.4632785Z    Compiling spt-msg v0.55.0 (C:\actions-runner\_work\spt-bs-core\spt-bs-core\crates\spt-msg)
2026-08-17T23:35:36.5489809Z    Compiling iroh-base v0.98.0
2026-08-17T23:35:37.0256428Z    Compiling num_enum v0.7.6
2026-08-17T23:35:37.0690615Z    Compiling iroh-relay v0.98.0
2026-08-17T23:35:37.2186513Z    Compiling n0-watcher v0.6.1
2026-08-17T23:35:37.4069832Z    Compiling attohttpc v0.30.1
2026-08-17T23:35:37.4269987Z    Compiling simple-dns v0.9.3
2026-08-17T23:35:37.6656367Z    Compiling tokio-stream v0.1.18
2026-08-17T23:35:38.0205315Z    Compiling serial-core v0.4.0
2026-08-17T23:35:38.1577277Z    Compiling serde_spanned v0.6.9
2026-08-17T23:35:38.2489157Z    Compiling toml_datetime v0.6.11
2026-08-17T23:35:38.4688879Z    Compiling thiserror-impl v1.0.69
2026-08-17T23:35:38.5735362Z    Compiling ref-cast-impl v1.0.25
2026-08-17T23:35:38.9038036Z    Compiling serde_derive_internals v0.29.1
2026-08-17T23:35:39.0607283Z    Compiling arrayref v0.3.9
2026-08-17T23:35:39.1069360Z    Compiling winnow v0.7.15
2026-08-17T23:35:39.3043136Z    Compiling resolv-conf v0.7.6
2026-08-17T23:35:39.6404534Z    Compiling constant_time_eq v0.4.2
2026-08-17T23:35:39.6951619Z    Compiling smol_str v0.1.24
2026-08-17T23:35:39.8046322Z    Compiling sha1_smol v1.0.1
2026-08-17T23:35:39.8432318Z    Compiling winreg v0.10.1
2026-08-17T23:35:39.9683405Z    Compiling simdutf8 v0.1.5
2026-08-17T23:35:40.0061817Z    Compiling toml_write v0.1.2
2026-08-17T23:35:40.1982144Z    Compiling toml_edit v0.22.27
2026-08-17T23:35:40.6002767Z    Compiling schemars_derive v1.2.1
2026-08-17T23:35:41.1444750Z    Compiling serial-windows v0.4.0
2026-08-17T23:35:41.2843892Z    Compiling iroh-dns v0.98.0
2026-08-17T23:35:41.6949748Z    Compiling igd-next v0.17.1
2026-08-17T23:35:43.9555123Z    Compiling lru v0.16.4
2026-08-17T23:35:44.0110077Z    Compiling hmac v0.12.1
2026-08-17T23:35:44.0957867Z    Compiling webpki-roots v1.0.7
2026-08-17T23:35:44.0970557Z    Compiling darling_core v0.23.0
2026-08-17T23:35:44.1800073Z    Compiling seize v0.5.1
2026-08-17T23:35:44.5474810Z    Compiling iroh v0.98.2
2026-08-17T23:35:44.7856859Z    Compiling serde_bytes v0.11.19
2026-08-17T23:35:44.9569242Z    Compiling once_cell_polyfill v1.70.2
2026-08-17T23:35:45.0602424Z    Compiling lazy_static v1.5.0
2026-08-17T23:35:45.1241882Z    Compiling pin-utils v0.1.0
2026-08-17T23:35:45.1774532Z    Compiling dyn-clone v1.0.20
2026-08-17T23:35:45.2739804Z    Compiling bitflags v1.3.2
2026-08-17T23:35:45.3666041Z    Compiling cmov v0.5.4
2026-08-17T23:35:45.5162946Z    Compiling anstyle v1.0.14
2026-08-17T23:35:45.6754052Z    Compiling anstyle-wincon v3.0.11
2026-08-17T23:35:45.6921347Z    Compiling ctutils v0.4.2
2026-08-17T23:35:45.8553161Z    Compiling nix v0.25.1
2026-08-17T23:35:45.8853200Z    Compiling schemars v1.2.1
2026-08-17T23:35:45.9222313Z    Compiling shared_library v0.1.9
2026-08-17T23:35:46.2014759Z    Compiling darling_macro v0.23.0
2026-08-17T23:35:46.2020962Z    Compiling papaya v0.2.4
2026-08-17T23:35:46.5215522Z    Compiling hkdf v0.12.4
2026-08-17T23:35:46.5254839Z    Compiling portmapper v0.16.0
2026-08-17T23:35:46.7188662Z    Compiling toml v0.8.23
2026-08-17T23:35:47.5129563Z    Compiling serial v0.4.0
2026-08-17T23:35:47.5872306Z    Compiling filedescriptor v0.8.3
2026-08-17T23:35:47.7405373Z    Compiling swarm-discovery v0.6.0-alpha.2 (https://github.com/SaberMage/swarm-discovery?rev=89a2200d54a4e3cab2f46cc75ebff49a1fb07614#89a2200d)
2026-08-17T23:35:48.2154138Z    Compiling anstyle-parse v1.0.0
2026-08-17T23:35:48.3381634Z    Compiling backon v1.6.0
2026-08-17T23:35:48.5265672Z    Compiling anstyle-query v1.1.5
2026-08-17T23:35:48.6279561Z    Compiling vte_generate_state_changes v0.1.2
2026-08-17T23:35:48.8367888Z    Compiling instability v0.3.12
2026-08-17T23:35:48.9742262Z    Compiling downcast-rs v1.2.1
2026-08-17T23:35:49.0465124Z    Compiling paste v1.0.15
2026-08-17T23:35:49.2304201Z    Compiling unicode-width v0.2.0
2026-08-17T23:35:49.4049079Z    Compiling foldhash v0.1.5
2026-08-17T23:35:49.5211693Z    Compiling colorchoice v1.0.5
2026-08-17T23:35:49.6054501Z    Compiling is_terminal_polyfill v1.70.2
2026-08-17T23:35:49.7000651Z    Compiling shell-words v1.1.1
2026-08-17T23:35:49.8206525Z    Compiling portable-pty v0.8.1
2026-08-17T23:35:50.6094014Z    Compiling anstream v1.0.0
2026-08-17T23:35:50.7355578Z    Compiling hashbrown v0.15.5
2026-08-17T23:35:51.0529204Z    Compiling vte v0.13.1
2026-08-17T23:35:51.1431226Z    Compiling spt-runtime v0.55.0 (C:\actions-runner\_work\spt-bs-core\spt-bs-core\crates\spt-runtime)
2026-08-17T23:35:51.5341558Z    Compiling spake2 v0.4.0
2026-08-17T23:35:51.5356185Z    Compiling darling v0.23.0
2026-08-17T23:35:51.7152535Z    Compiling itertools v0.13.0
2026-08-17T23:35:51.7638821Z    Compiling crossterm_winapi v0.9.1
2026-08-17T23:35:52.0129383Z    Compiling strum_macros v0.26.4
2026-08-17T23:35:52.6642278Z    Compiling sha1 v0.10.6
2026-08-17T23:35:52.8422455Z    Compiling castaway v0.2.4
2026-08-17T23:35:52.9210438Z    Compiling terminal_size v0.4.4
2026-08-17T23:35:53.0364232Z    Compiling recvmsg v1.0.0
2026-08-17T23:35:53.3003962Z    Compiling doctest-file v1.1.1
2026-08-17T23:35:53.3166535Z    Compiling clap_lex v1.1.0
2026-08-17T23:35:53.5720783Z    Compiling unicode-width v0.1.14
2026-08-17T23:35:53.6056481Z    Compiling indoc v2.0.7
2026-08-17T23:35:53.7437284Z    Compiling static_assertions v1.1.0
2026-08-17T23:35:53.7981367Z    Compiling compact_str v0.8.2
2026-08-17T23:35:54.3520144Z    Compiling unicode-truncate v1.1.0
2026-08-17T23:35:54.3787846Z    Compiling interprocess v2.4.2
2026-08-17T23:35:54.4469917Z    Compiling clap_builder v4.6.0
2026-08-17T23:35:55.2584034Z    Compiling strum v0.26.3
2026-08-17T23:35:55.4362041Z    Compiling spt-live v0.55.0 (C:\actions-runner\_work\spt-bs-core\spt-bs-core\crates\spt-live)
2026-08-17T23:35:56.3410843Z    Compiling crossterm v0.28.1
2026-08-17T23:35:57.3063572Z    Compiling spt-term v0.55.0 (C:\actions-runner\_work\spt-bs-core\spt-bs-core\crates\spt-term)
2026-08-17T23:35:58.3986588Z    Compiling lru v0.12.5
2026-08-17T23:35:58.9736121Z    Compiling clap_derive v4.6.1
2026-08-17T23:35:59.2093365Z    Compiling error-code v3.3.2
2026-08-17T23:35:59.3083099Z    Compiling cassowary v0.3.0
2026-08-17T23:35:59.8764656Z    Compiling ratatui v0.29.0
2026-08-17T23:35:59.8946968Z    Compiling clipboard-win v5.4.1
2026-08-17T23:36:00.3728326Z    Compiling nucleo-matcher v0.3.1
2026-08-17T23:36:00.5686464Z    Compiling clap v4.6.1
2026-08-17T23:36:00.7373930Z    Compiling qrcode v0.14.1
2026-08-17T23:36:10.0864895Z    Compiling rustls-webpki v0.103.13
2026-08-17T23:36:12.4953028Z    Compiling tokio-rustls v0.26.4
2026-08-17T23:36:12.4953460Z    Compiling noq-proto v0.17.0
2026-08-17T23:36:12.4953795Z    Compiling rustls-platform-verifier v0.7.0
2026-08-17T23:36:12.7792198Z    Compiling hyper-rustls v0.27.9
2026-08-17T23:36:12.8067584Z    Compiling hickory-net v0.26.0-beta.4
2026-08-17T23:36:13.0148180Z    Compiling reqwest v0.13.4
2026-08-17T23:36:14.6946999Z    Compiling hickory-resolver v0.26.0-beta.4
2026-08-17T23:36:17.7742381Z    Compiling tokio-websockets v0.13.2
2026-08-17T23:36:35.4294781Z    Compiling spt-net v0.55.0 (C:\actions-runner\_work\spt-bs-core\spt-bs-core\crates\spt-net)
2026-08-17T23:36:37.2721420Z    Compiling spt-daemon v0.55.0 (C:\actions-runner\_work\spt-bs-core\spt-bs-core\crates\spt-daemon)
2026-08-17T23:36:52.6869414Z    Compiling spt v0.55.0 (C:\actions-runner\_work\spt-bs-core\spt-bs-core\crates\spt)
2026-08-17T23:36:52.9608482Z     Finished `dev` profile [unoptimized + debuginfo] target(s) in 2m 18s
2026-08-17T23:36:53.0575074Z ##[group]Run cargo nextest run --workspace -E 'kind(lib) + kind(bin)'
2026-08-17T23:36:53.0575427Z [36;1mcargo nextest run --workspace -E 'kind(lib) + kind(bin)'[0m
2026-08-17T23:36:53.0579965Z shell: C:\Program Files\PowerShell\7\pwsh.EXE -command ". '{0}'"
2026-08-17T23:36:53.0580188Z ##[endgroup]
2026-08-17T23:36:54.7715325Z    Compiling fastrand v2.4.1
2026-08-17T23:36:54.7731510Z    Compiling spt-poolguard v0.55.0 (C:\actions-runner\_work\spt-bs-core\spt-bs-core\crates\spt-poolguard)
2026-08-17T23:36:54.8246363Z    Compiling bytemuck v1.25.2
2026-08-17T23:36:54.8246698Z    Compiling mock-adapter v0.55.0 (C:\actions-runner\_work\spt-bs-core\spt-bs-core\adapters\mock)
2026-08-17T23:36:54.9530373Z    Compiling tempfile v3.27.0
2026-08-17T23:36:54.9759620Z    Compiling futures-lite v2.6.1
2026-08-17T23:36:55.3309286Z    Compiling backon v1.6.0
2026-08-17T23:36:55.3882178Z    Compiling spt-test-support v0.55.0 (C:\actions-runner\_work\spt-bs-core\spt-bs-core\crates\spt-test-support)
2026-08-17T23:36:55.5215928Z    Compiling n0-future v0.3.2
2026-08-17T23:36:55.5242753Z    Compiling rgb v0.8.53
2026-08-17T23:36:55.6341413Z    Compiling n0-watcher v0.6.1
2026-08-17T23:36:55.6341717Z    Compiling iroh-dns v0.98.0
2026-08-17T23:36:55.6367703Z    Compiling spt-store v0.55.0 (C:\actions-runner\_work\spt-bs-core\spt-bs-core\crates\spt-store)
2026-08-17T23:36:55.7652846Z    Compiling netwatch v0.16.0
2026-08-17T23:36:55.8078124Z    Compiling avt v0.18.0
2026-08-17T23:36:55.9893380Z    Compiling iroh-relay v0.98.0
2026-08-17T23:36:56.7938044Z    Compiling portmapper v0.16.0
2026-08-17T23:37:00.7309127Z    Compiling spt-msg v0.55.0 (C:\actions-runner\_work\spt-bs-core\spt-bs-core\crates\spt-msg)
2026-08-17T23:37:01.5565171Z    Compiling spt-term v0.55.0 (C:\actions-runner\_work\spt-bs-core\spt-bs-core\crates\spt-term)
2026-08-17T23:37:03.8843481Z    Compiling spt-runtime v0.55.0 (C:\actions-runner\_work\spt-bs-core\spt-bs-core\crates\spt-runtime)
2026-08-17T23:37:04.2716537Z    Compiling iroh v0.98.2
2026-08-17T23:37:08.2088038Z    Compiling spt-live v0.55.0 (C:\actions-runner\_work\spt-bs-core\spt-bs-core\crates\spt-live)
2026-08-17T23:37:19.4936607Z    Compiling spt-proto v0.55.0 (C:\actions-runner\_work\spt-bs-core\spt-bs-core\crates\spt-proto)
2026-08-17T23:37:19.8570750Z    Compiling spt-procident v0.55.0 (C:\actions-runner\_work\spt-bs-core\spt-bs-core\crates\spt-procident)
2026-08-17T23:37:24.0283203Z    Compiling spt-net v0.55.0 (C:\actions-runner\_work\spt-bs-core\spt-bs-core\crates\spt-net)
2026-08-17T23:37:25.9004548Z    Compiling spt-daemon v0.55.0 (C:\actions-runner\_work\spt-bs-core\spt-bs-core\crates\spt-daemon)
2026-08-17T23:37:46.3562939Z    Compiling spt v0.55.0 (C:\actions-runner\_work\spt-bs-core\spt-bs-core\crates\spt)
2026-08-17T23:38:23.2410521Z    Compiling xtask v0.55.0 (C:\actions-runner\_work\spt-bs-core\spt-bs-core\crates\xtask)
2026-08-17T23:40:26.4158221Z     Finished `test` profile [unoptimized + debuginfo] target(s) in 3m 32s
2026-08-17T23:40:33.0358135Z ────────────
2026-08-17T23:40:33.0358977Z  Nextest run ID d5967a2c-7b89-4cb6-a3fc-fd205a701aef with nextest profile: default
2026-08-17T23:40:33.0359534Z     Starting 2562 tests across 24 binaries (1 test and 167 binaries skipped)
2026-08-17T23:40:33.0603114Z         PASS [   0.014s] (   1/2562) mock-adapter::bin/capture-player tests::parses_a_well_formed_record
2026-08-17T23:40:33.0652817Z         PASS [   0.021s] (   2/2562) spt::bin/spt accessview::tests::drill_matches_only_its_own_kind
2026-08-17T23:40:33.0712572Z         PASS [   0.027s] (   3/2562) spt::bin/spt api::auth::tests::mints_distinct_nonempty_tokens
2026-08-17T23:40:33.0803832Z         PASS [   0.037s] (   4/2562) spt::bin/spt accessview::tests::target_roster_groups_types_and_counts_rules
2026-08-17T23:40:33.1051408Z         PASS [   0.061s] (   5/2562) spt::bin/spt api::auth::tests::dead_owner_repin_refused_when_sid_owns_another_perch
2026-08-17T23:40:33.1162444Z         PASS [   0.072s] (   6/2562) spt::bin/spt api::auth::tests::a_recycled_owner_pid_no_longer_blocks_the_dead_owner_rescue
2026-08-17T23:40:33.1344262Z         PASS [   0.091s] (   7/2562) spt::bin/spt api::auth::tests::an_unverifiable_live_owner_never_grants_a_repin
2026-08-17T23:40:33.1401991Z         PASS [   0.096s] (   8/2562) spt::bin/spt api::auth::tests::missing_endpoint_is_no_endpoint
2026-08-17T23:40:33.1491808Z         PASS [   0.105s] (   9/2562) spt::bin/spt accessview::tests::a_pinned_open_renders_apart_from_a_default_open
2026-08-17T23:40:33.1589026Z         PASS [   0.115s] (  10/2562) spt::bin/spt accessview::tests::node_roster_lists_node_scope_entities_and_mode_exceptions
2026-08-17T23:40:33.1687115Z         PASS [   0.125s] (  11/2562) spt::bin/spt api::auth::tests::dead_owner_repin_refused_when_sid_is_a_psyche_custody_sid
2026-08-17T23:40:33.1767893Z         PASS [   0.133s] (  12/2562) mock-adapter::bin/capture-player tests::refuses_a_length_mismatch
2026-08-17T23:40:33.1887849Z         PASS [   0.145s] (  13/2562) spt::bin/spt api::auth::tests::no_proof_is_refused
2026-08-17T23:40:33.1898766Z         PASS [   0.146s] (  14/2562) spt::bin/spt api::auth::tests::live_owner_mismatch_still_refuses
2026-08-17T23:40:33.2067283Z         PASS [   0.126s] (  15/2562) spt::bin/spt api::auth::tests::worker_missing_is_no_endpoint
2026-08-17T23:40:33.2694665Z         PASS [   0.225s] (  16/2562) spt::bin/spt api::auth::tests::pinned_to_dead_sid_mismatched_poll_repins
2026-08-17T23:40:33.2695596Z         PASS [   0.209s] (  17/2562) spt::bin/spt api::auth::tests::session_id_proof_authenticates
2026-08-17T23:40:33.2715491Z         PASS [   0.206s] (  18/2562) spt::bin/spt api::auth::tests::token_auth_path_unchanged
2026-08-17T23:40:33.2725133Z         PASS [   0.201s] (  19/2562) spt::bin/spt api::auth::tests::token_proof_authenticates
2026-08-17T23:40:33.2738651Z         PASS [   0.230s] (  20/2562) spt::bin/spt api::auth::tests::dead_owner_repin_still_rescues_a_non_custody_sid
2026-08-17T23:40:33.2935011Z         PASS [   0.188s] (  21/2562) spt::bin/spt api::auth::tests::worker_parent_current_sid_authenticates_after_rotation
2026-08-17T23:40:33.2951272Z         PASS [   0.161s] (  22/2562) spt::bin/spt api::auth::tests::worker_wrong_sid_and_token_only_refused
2026-08-17T23:40:33.2975638Z         PASS [   0.181s] (  23/2562) spt::bin/spt api::auth::tests::worker_stored_sid_authenticates
2026-08-17T23:40:33.2991066Z         PASS [   0.140s] (  24/2562) spt::bin/spt api::delivery::tests::echo_gate_explicit_toggle
2026-08-17T23:40:33.3044452Z         PASS [   0.164s] (  25/2562) spt::bin/spt api::auth::tests::wrong_token_and_wrong_session_refused
2026-08-17T23:40:33.3193931Z         PASS [   0.170s] (  26/2562) spt::bin/spt api::delivery::tests::an_undated_state_is_dated_by_a_non_edge_report
2026-08-17T23:40:33.3695757Z         PASS [   0.199s] (  27/2562) spt::bin/spt api::delivery::tests::idle_busy_transitions_manage_sentinels
2026-08-17T23:40:33.3713535Z         PASS [   0.182s] (  28/2562) spt::bin/spt api::delivery::tests::idle_no_gate_does_not_arm_gate
2026-08-17T23:40:33.3729576Z         PASS [   0.166s] (  29/2562) spt::bin/spt api::delivery::tests::inject_resolution_drops_pty_defaults_hook
2026-08-17T23:40:33.3744232Z         PASS [   0.185s] (  30/2562) spt::bin/spt api::delivery::tests::inject_all_pty_falls_back_to_hook
2026-08-17T23:40:33.4403748Z         PASS [   0.143s] (  31/2562) spt::bin/spt api::engineroom::tests::a_pin_is_not_a_clear
2026-08-17T23:40:33.4453358Z         PASS [   0.146s] (  32/2562) spt::bin/spt api::engineroom::tests::a_refresh_adopts_only_a_real_divergence
2026-08-17T23:40:33.4500136Z         PASS [   0.146s] (  33/2562) spt::bin/spt api::engineroom::tests::an_admin_code_verifies_across_the_ceremony_window_only
2026-08-17T23:40:33.4549125Z         PASS [   0.135s] (  34/2562) spt::bin/spt api::engineroom::tests::subnet_authority_is_the_empowerment_not_the_gate
2026-08-17T23:40:33.4652125Z         PASS [   0.095s] (  35/2562) spt::bin/spt api::engineroom::tests::the_gate_admits_only_the_reserved_id_provisioned_and_authenticated
2026-08-17T23:40:33.4681078Z         PASS [   0.199s] (  36/2562) spt::bin/spt api::delivery::tests::only_a_real_state_edge_stamps_the_transition_instant
2026-08-17T23:40:33.4716996Z         PASS [   0.101s] (  37/2562) spt::bin/spt api::engineroom::tests::the_perch_minting_verbs_admit_the_reserved_id_only_as_a_completion
2026-08-17T23:40:33.4853285Z         PASS [   0.045s] (  38/2562) spt::bin/spt api::engineroom::tests::the_unset_echo_names_what_governs_next
2026-08-17T23:40:33.4957303Z         PASS [   0.050s] (  39/2562) spt::bin/spt api::engineroom::tests::the_written_node_mode_is_the_one_the_chain_reads
2026-08-17T23:40:33.4990912Z         PASS [   0.126s] (  40/2562) spt::bin/spt api::engineroom::tests::the_surface_mode_verb_refuses_a_caller_that_is_not_the_engine_room
2026-08-17T23:40:33.5335169Z         PASS [   0.062s] (  41/2562) spt::bin/spt api::reporting::tests::boundary_missing_perch_refused
2026-08-17T23:40:33.5557864Z         PASS [   0.181s] (  42/2562) spt::bin/spt api::engineroom::tests::the_surface_mode_verb_refuses_an_unminted_surface_and_writes_nothing
2026-08-17T23:40:33.5871514Z         PASS [   0.031s] (  43/2562) spt::bin/spt api::reporting::tests::capability_lists_hostable_types
2026-08-17T23:40:33.6373522Z         PASS [   0.141s] (  44/2562) spt::bin/spt api::reporting::tests::boundary_refuses_rotating_onto_a_psyche_custody_sid
2026-08-17T23:40:33.6410815Z         PASS [   0.463s] (  45/2562) spt::bin/spt api::delivery::tests::idle_drain_peek_returns_non_deferred_rows_only
2026-08-17T23:40:33.6782071Z         PASS [   0.091s] (  46/2562) spt::bin/spt api::reporting::tests::digest_entry_validates_and_appends_to_digest_log
2026-08-17T23:40:33.6917165Z         PASS [   0.014s] (  47/2562) spt::bin/spt api::reporting::tests::endpoint_info_attached_node_from_honest_stamps
2026-08-17T23:40:33.7353449Z         PASS [   0.442s] (  48/2562) spt::bin/spt api::delivery::tests::poll_only_drains_when_hook_method_present
2026-08-17T23:40:33.7516567Z         PASS [   0.110s] (  49/2562) spt::bin/spt api::reporting::tests::endpoint_info_activity_word_tracks_the_idle_sentinel
2026-08-17T23:40:33.7522737Z         PASS [   0.478s] (  50/2562) spt::bin/spt api::delivery::tests::poll_drains_non_deferred_by_default
2026-08-17T23:40:33.7532334Z         PASS [   0.061s] (  51/2562) spt::bin/spt api::reporting::tests::endpoint_info_attached_node_self_attributes_own_node_driver
2026-08-17T23:40:33.7577769Z         PASS [   0.022s] (  52/2562) spt::bin/spt api::reporting::tests::endpoint_info_json_always_carries_an_activity_word
2026-08-17T23:40:33.7696415Z         PASS [   0.017s] (  53/2562) spt::bin/spt api::reporting::tests::env_aliases_resolved_from_manifest
2026-08-17T23:40:33.7792028Z         PASS [   0.021s] (  54/2562) spt::bin/spt api::reporting::tests::filedrops_are_fixed_named_files
2026-08-17T23:40:33.8174433Z         PASS [   0.180s] (  55/2562) spt::bin/spt api::reporting::tests::driven_by_reads_daemon_marker
2026-08-17T23:40:33.8588694Z         PASS [   0.373s] (  56/2562) spt::bin/spt api::reporting::tests::boundary_rebinds_keeping_anchor
2026-08-17T23:40:33.8703706Z         PASS [   0.119s] (  57/2562) spt::bin/spt api::reporting::tests::endpoint_info_reports_and_refuses
2026-08-17T23:40:33.8728764Z         PASS [   0.423s] (  58/2562) spt::bin/spt api::reporting::tests::a_non_engine_room_boundary_never_moves_the_seats_empowerment
2026-08-17T23:40:33.8967476Z         PASS [   0.627s] (  59/2562) spt::bin/spt api::delivery::tests::poll_drain_holds_deferred_while_resting_and_releases_once_on_wake
2026-08-17T23:40:33.9083574Z         PASS [   0.443s] (  60/2562) spt::bin/spt api::reporting::tests::boundary_appends_to_the_session_ledger
2026-08-17T23:40:33.9110686Z         PASS [   0.141s] (  61/2562) spt::bin/spt api::reporting::tests::hint_once_per_session_one_per_message
2026-08-17T23:40:33.9124088Z         PASS [   0.133s] (  62/2562) spt::bin/spt api::reporting::tests::history_log_appends
2026-08-17T23:40:33.9125286Z         PASS [   0.457s] (  63/2562) spt::bin/spt api::reporting::tests::a_rotated_away_session_id_cannot_resurrect_a_dropped_empowerment
2026-08-17T23:40:33.9188689Z         PASS [   0.101s] (  64/2562) spt::bin/spt api::reporting::tests::misplaced_drop_is_still_found_once_the_anchor_is_correct
2026-08-17T23:40:33.9274365Z         PASS [   0.656s] (  65/2562) spt::bin/spt api::delivery::tests::poll_drain_suppresses_idle_only_which_reaches_the_relay
2026-08-17T23:40:33.9275378Z         PASS [   0.069s] (  66/2562) spt::bin/spt api::reporting::tests::presence_records_endpoint
2026-08-17T23:40:33.9285405Z         PASS [   0.395s] (  67/2562) spt::bin/spt api::reporting::tests::boundary_with_a_fresh_sid_is_unaffected_by_the_squat_guard
2026-08-17T23:40:33.9942015Z         PASS [   0.695s] (  68/2562) spt::bin/spt api::engineroom::tests::a_non_engine_room_attempt_never_touches_the_empower_ledger
2026-08-17T23:40:33.9995096Z         PASS [   0.244s] (  69/2562) spt::bin/spt api::reporting::tests::erase_unregisters_regardless_of_liveness
2026-08-17T23:40:34.0236351Z         PASS [   0.751s] (  70/2562) spt::bin/spt api::delivery::tests::poll_drain_validates_notify_copies_against_their_rows
2026-08-17T23:40:34.0829367Z         PASS [   0.171s] (  71/2562) spt::bin/spt api::startup::tests::a_dead_binder_pid_proves_nothing_and_never_drops_the_stamp
2026-08-17T23:40:34.0839328Z         PASS [   0.187s] (  72/2562) spt::bin/spt api::reporting::tests::session_end_erase_wipes_childless_perch
2026-08-17T23:40:34.1089042Z         PASS [   0.190s] (  73/2562) spt::bin/spt api::tests::adapter_is_optional
2026-08-17T23:40:34.1204564Z         PASS [   0.193s] (  74/2562) spt::bin/spt api::tests::ctx_manifest_override_wins_when_manifest_present
2026-08-17T23:40:34.1211623Z         PASS [   0.193s] (  75/2562) spt::bin/spt api::tests::ctx_manifest_unregistered_no_manifest_is_none_not_fatal
2026-08-17T23:40:34.1428789Z         PASS [   0.145s] (  76/2562) spt::bin/spt api::tests::state_value_is_validated
2026-08-17T23:40:34.1432969Z         PASS [   0.153s] (  77/2562) spt::bin/spt api::tests::load_manifest_resolves_composite_adapter_option
2026-08-17T23:40:34.1509557Z         PASS [   0.224s] (  78/2562) spt::bin/spt api::tests::ctx_manifest_resolves_from_registry_when_manifest_absent
2026-08-17T23:40:34.1632944Z         PASS [   0.255s] (  79/2562) spt::bin/spt api::reporting::tests::session_end_soft_preserves_state
2026-08-17T23:40:34.1647741Z         PASS [   0.254s] (  80/2562) spt::bin/spt api::reporting::tests::soft_end_preserves_a_live_listeners_address
2026-08-17T23:40:34.1660003Z         PASS [   0.142s] (  81/2562) spt::bin/spt api::tests::surface_parses
2026-08-17T23:40:34.1733671Z         PASS [   0.090s] (  82/2562) spt::bin/spt api::startup::tests::a_dead_relays_capability_stamp_is_not_resurrected_by_a_listener_rebind
2026-08-17T23:40:34.1745022Z         PASS [   0.302s] (  83/2562) spt::bin/spt api::reporting::tests::session_end_erase_refused_with_live_children
2026-08-17T23:40:34.1755348Z         PASS [   0.707s] (  84/2562) spt::bin/spt api::reporting::tests::boundary_injects_deferred_shell_context
2026-08-17T23:40:34.1928149Z         PASS [   0.694s] (  85/2562) spt::bin/spt api::reporting::tests::boundary_resurfaces_undismissed_notifs
2026-08-17T23:40:34.2332678Z         PASS [   0.070s] (  86/2562) spt::bin/spt cli::lifecycle_verb_decisions::remembered_defaults_prefer_the_newest_row_field_by_field
2026-08-17T23:40:34.2479850Z         PASS [   0.083s] (  87/2562) spt::bin/spt cli::lifecycle_verb_decisions::the_adapter_precedence_is_flag_then_endpoint_then_a_sole_installed_one
2026-08-17T23:40:34.2482647Z         PASS [   0.336s] (  88/2562) spt::bin/spt api::reporting::tests::soft_end_still_cleans_a_dead_listeners_address
2026-08-17T23:40:34.2495536Z         PASS [   0.379s] (  89/2562) spt::bin/spt api::reporting::tests::session_end_erase_reaps_stale_worker_then_proceeds
2026-08-17T23:40:34.2543834Z         PASS [   0.088s] (  90/2562) spt::bin/spt cli::lifecycle_verb_decisions::the_go_ladder_takes_the_ratified_rung
2026-08-17T23:40:34.2737819Z         PASS [   0.190s] (  91/2562) spt::bin/spt api::worker::tests::cascade_guard_tracks_live_children
2026-08-17T23:40:34.3278905Z         PASS [   0.177s] (  92/2562) spt::bin/spt api::worker::tests::worker_start_registration_sid_falls_back_to_presented
2026-08-17T23:40:34.3281041Z         PASS [   0.154s] (  93/2562) spt::bin/spt cli::reserved_id_tests::endpoint_run_refuses_the_reserved_id_and_saves_nothing
2026-08-17T23:40:34.3324965Z         PASS [   0.188s] (  94/2562) spt::bin/spt api::worker::tests::worker_start_nests_under_parent
2026-08-17T23:40:34.3325742Z         PASS [   0.222s] (  95/2562) spt::bin/spt api::worker::tests::guard_clears_only_when_all_children_stopped
2026-08-17T23:40:34.3457239Z         PASS [   0.203s] (  96/2562) spt::bin/spt api::worker::tests::worker_start_mints_id_stores_parent_sid_and_metadata
2026-08-17T23:40:34.3525601Z         PASS [   0.119s] (  97/2562) spt::bin/spt cli::resume_resolution_tests::resume_never_feeds_a_provisional
2026-08-17T23:40:34.3544458Z         PASS [   0.106s] (  98/2562) spt::bin/spt cli::retired_verb_pre_scan::the_pre_scan_reads_the_verb_position_only
2026-08-17T23:40:34.3552148Z         PASS [   0.162s] (  99/2562) spt::bin/spt cli::reserved_id_tests::the_lifecycle_verbs_refuse_their_preconditions
2026-08-17T23:40:34.4059538Z         PASS [   0.157s] ( 100/2562) spt::bin/spt cli::retired_verb_pre_scan::the_retired_verb_refuses_with_a_pointer_a_generic_error_cannot_fake
2026-08-17T23:40:34.4068687Z         PASS [   0.157s] ( 101/2562) spt::bin/spt cli::run_home_tests::order_by_mru_orders_guidance
2026-08-17T23:40:34.4142513Z         PASS [   0.160s] ( 102/2562) spt::bin/spt cli::run_home_tests::run_home_resolution_matrix
2026-08-17T23:40:34.4173932Z         PASS [   0.144s] ( 103/2562) spt::bin/spt cli::run_on_live_tests::run_on_live_never_duplicates_and_create_conflicts
2026-08-17T23:40:34.4271268Z         PASS [   0.099s] ( 104/2562) spt::bin/spt cli::tests::a_mint_captures_its_declared_mode_and_nothing_else
2026-08-17T23:40:34.4856203Z         PASS [   0.140s] ( 105/2562) spt::bin/spt cli::tests::a_notfound_lands_locally_only_when_the_target_is_an_endpoint_here
2026-08-17T23:40:34.4939883Z         PASS [   0.141s] ( 106/2562) spt::bin/spt cli::tests::a_one_way_approval_hands_over_a_reverse_command_that_parses
2026-08-17T23:40:34.5009013Z         PASS [   0.146s] ( 107/2562) spt::bin/spt cli::tests::a_remote_send_receive_claims_only_what_it_can_deliver
2026-08-17T23:40:34.5058916Z         PASS [   0.100s] ( 108/2562) spt::bin/spt cli::tests::a_reply_carried_request_is_not_stamped_as_a_first_order_knock
2026-08-17T23:40:34.5096895Z         PASS [   0.103s] ( 109/2562) spt::bin/spt cli::tests::a_retired_flag_names_what_replaced_it
2026-08-17T23:40:34.5147187Z         PASS [   0.101s] ( 110/2562) spt::bin/spt cli::tests::a_row_without_a_node_says_so_and_one_with_a_node_shows_it
2026-08-17T23:40:34.5607097Z         PASS [   0.143s] ( 111/2562) spt::bin/spt cli::tests::a_rule_describes_itself_in_plain_words
2026-08-17T23:40:34.5644362Z         PASS [   0.137s] ( 112/2562) spt::bin/spt cli::tests::a_sealed_codes_subnet_is_chosen_and_never_guessed
2026-08-17T23:40:34.5820504Z         PASS [   0.096s] ( 113/2562) spt::bin/spt cli::tests::a_sender_rule_on_a_non_attributable_surface_is_refused
2026-08-17T23:40:34.5859673Z         PASS [   0.092s] ( 114/2562) spt::bin/spt cli::tests::a_status_row_reads_held_over_running_and_carries_its_evidence
2026-08-17T23:40:34.5943829Z         PASS [   0.093s] ( 115/2562) spt::bin/spt cli::tests::a_subcommand_name_beats_the_bare_target
2026-08-17T23:40:34.6117734Z         PASS [   0.097s] ( 116/2562) spt::bin/spt cli::tests::adapter_add_transport_flags_parse
2026-08-17T23:40:34.6181145Z         PASS [   0.108s] ( 117/2562) spt::bin/spt cli::tests::access_subcommands_parse
2026-08-17T23:40:34.6737957Z         PASS [   0.079s] ( 118/2562) spt::bin/spt cli::tests::adapter_name_validation_flags_every_unknown
2026-08-17T23:40:34.6806367Z         PASS [   0.069s] ( 119/2562) spt::bin/spt cli::tests::adapter_names_comma_list_parses_and_refuses_empties
2026-08-17T23:40:36.0949746Z         PASS [   1.585s] ( 120/2562) spt::bin/spt cli::tests::a_wedged_probe_costs_one_ceiling_and_reads_unknown_not_offline
2026-08-17T23:40:36.1280374Z         PASS [   1.447s] ( 121/2562) spt::bin/spt cli::tests::adapter_subcommands_parse
2026-08-17T23:40:37.0040509Z         PASS [   2.328s] ( 122/2562) spt::bin/spt cli::tests::adapter_string_verbs
2026-08-17T23:40:37.0044049Z         PASS [   2.676s] ( 123/2562) spt::bin/spt cli::tests::a_local_hit_never_asks_the_broker
2026-08-17T23:40:37.0050740Z         PASS [   2.423s] ( 124/2562) spt::bin/spt cli::tests::adapter_has_live_endpoint_detects_matching_live_perch
2026-08-17T23:40:37.0060865Z         PASS [   2.885s] ( 125/2562) spt::bin/spt api::worker::tests::worker_poll_holds_deferred_while_resting
2026-08-17T23:40:37.0061529Z         PASS [   2.388s] ( 126/2562) spt::bin/spt cli::tests::adapter_profile_verbs_local_only
2026-08-17T23:40:37.0179092Z         PASS [   2.685s] ( 127/2562) spt::bin/spt cli::tests::a_minted_sealed_code_is_the_one_that_opens_to_its_record
2026-08-17T23:40:37.0182833Z         PASS [   2.686s] ( 128/2562) spt::bin/spt cli::tests::a_non_attributable_bake_needs_the_acknowledgment_and_keeps_it
2026-08-17T23:40:37.0530845Z         PASS [   2.466s] ( 129/2562) spt::bin/spt cli::tests::adapter_has_live_endpoint_false_for_other_or_dead
2026-08-17T23:40:37.0840994Z         PASS [   2.963s] ( 130/2562) spt::bin/spt api::worker::tests::worker_poll_drains_spool
2026-08-17T23:40:37.1150216Z         PASS [   0.110s] ( 131/2562) spt::bin/spt cli::tests::adapter_update_notice_absent_when_no_message
2026-08-17T23:40:37.1234611Z         PASS [   0.121s] ( 132/2562) spt::bin/spt cli::tests::adapter_update_install_dir_is_registered_source_dir_not_repo_name
2026-08-17T23:40:37.1396422Z         PASS [   0.134s] ( 133/2562) spt::bin/spt cli::tests::adapter_update_notice_renders_declared_message_markdown
2026-08-17T23:40:37.1439342Z         PASS [   1.016s] ( 134/2562) spt::bin/spt cli::tests::adapter_translate_proof_parses
2026-08-17T23:40:37.1484361Z         PASS [   0.142s] ( 135/2562) spt::bin/spt cli::tests::adapter_update_summary_and_exit_aggregate_isolated_failures
2026-08-17T23:40:37.1542776Z         PASS [   0.138s] ( 136/2562) spt::bin/spt cli::tests::adapter_version_parses
2026-08-17T23:40:37.1587321Z         PASS [   0.106s] ( 137/2562) spt::bin/spt cli::tests::agent_ground_describes_itself_exactly_as_the_ceremony_always_did
2026-08-17T23:40:37.1751947Z         PASS [   0.158s] ( 138/2562) spt::bin/spt cli::tests::adapter_version_surfaces_declared_adapter_version
2026-08-17T23:40:37.1844536Z         PASS [   0.178s] ( 139/2562) spt::bin/spt cli::tests::adapter_use_sets_and_clears_pointer
2026-08-17T23:40:37.2050298Z         PASS [   0.121s] ( 140/2562) spt::bin/spt cli::tests::all_hidden_this_node_suppresses_no_perches_marker
2026-08-17T23:40:37.2124328Z         PASS [   0.098s] ( 141/2562) spt::bin/spt cli::tests::already_applied_message_reads_up_to_date_no_restart
2026-08-17T23:40:37.2164615Z         PASS [   0.093s] ( 142/2562) spt::bin/spt cli::tests::an_addressed_target_is_local_only_when_its_node_half_names_this_node
2026-08-17T23:40:37.2216618Z         PASS [   0.082s] ( 143/2562) spt::bin/spt cli::tests::an_approval_binds_the_subject_the_knocks_origin_implies
2026-08-17T23:40:37.2280815Z         PASS [   0.084s] ( 144/2562) spt::bin/spt cli::tests::an_empty_stored_surface_list_still_means_every_surface
2026-08-17T23:40:37.2333959Z         PASS [   0.086s] ( 145/2562) spt::bin/spt cli::tests::an_empty_unlisted_set_renders_no_heading_at_all
2026-08-17T23:40:37.2402105Z         PASS [   3.067s] ( 146/2562) spt::bin/spt api::startup::tests::a_listener_over_a_dead_pty_is_not_offlined_by_the_liveness_reconcile
2026-08-17T23:40:37.2456206Z         PASS [   0.087s] ( 147/2562) spt::bin/spt cli::tests::an_excluded_knock_is_neither_a_landing_nor_a_wire_refusal
2026-08-17T23:40:37.2560998Z         PASS [   0.080s] ( 148/2562) spt::bin/spt cli::tests::an_undelivered_receipt_reports_only_the_receipt
2026-08-17T23:40:37.2669235Z         PASS [   0.062s] ( 149/2562) spt::bin/spt cli::tests::any_single_evidence_source_is_enough_and_only_nothing_refuses
2026-08-17T23:40:37.2685926Z         PASS [   2.708s] ( 150/2562) spt::bin/spt cli::tests::adapter_digest_proof_fills_session_id_key
2026-08-17T23:40:37.2692035Z         PASS [   0.085s] ( 151/2562) spt::bin/spt cli::tests::answering_verbs_declare_no_directionality
2026-08-17T23:40:37.2731122Z         PASS [   2.709s] ( 152/2562) spt::bin/spt cli::tests::adapter_digest_proof_gates_on_drops
2026-08-17T23:40:37.2844611Z         PASS [   0.072s] ( 153/2562) spt::bin/spt cli::tests::api_adapter_flag_is_group_level_not_post_subcommand
2026-08-17T23:40:37.2878422Z         PASS [   0.071s] ( 154/2562) spt::bin/spt cli::tests::api_listen_accepts_session_id_flag
2026-08-17T23:40:37.2944753Z         PASS [   0.073s] ( 155/2562) spt::bin/spt cli::tests::applied_message_appends_restart_required_notice
2026-08-17T23:40:37.2969326Z         PASS [   0.069s] ( 156/2562) spt::bin/spt cli::tests::applied_message_renders_semver_or_counter_fallback_and_states_applied
2026-08-17T23:40:37.3423602Z         PASS [   0.075s] ( 157/2562) spt::bin/spt cli::tests::bare_tty_guard
2026-08-17T23:40:37.3425858Z         PASS [   0.087s] ( 158/2562) spt::bin/spt cli::tests::bare_spt_parses_to_none
2026-08-17T23:40:37.3648978Z         PASS [   0.125s] ( 159/2562) spt::bin/spt api::startup::tests::a_live_owner_whose_birth_matches_still_refuses_the_bind
2026-08-17T23:40:37.3860038Z         PASS [   0.139s] ( 160/2562) spt::bin/spt cli::tests::apply_user_msg_gate_local_origination
2026-08-17T23:40:37.4059548Z         PASS [   0.137s] ( 161/2562) spt::bin/spt cli::tests::bare_update_parses_composite_flags
2026-08-17T23:40:37.4110834Z         PASS [   0.136s] ( 162/2562) spt::bin/spt cli::tests::broker_image_line_reports_without_warning_or_remedy
2026-08-17T23:40:37.4175538Z         PASS [   0.148s] ( 163/2562) spt::bin/spt cli::tests::both_knock_answer_surfaces_take_a_monic
2026-08-17T23:40:37.4293190Z         PASS [   0.135s] ( 164/2562) spt::bin/spt cli::tests::classify_multiplatform_captures_only_known_triples
2026-08-17T23:40:37.4296153Z         PASS [   0.145s] ( 165/2562) spt::bin/spt cli::tests::classify_fetch_reject_matrix
2026-08-17T23:40:37.4297555Z         PASS [   0.142s] ( 166/2562) spt::bin/spt cli::tests::classify_flat_archive_never_misfires
2026-08-17T23:40:37.4343526Z         PASS [   0.137s] ( 167/2562) spt::bin/spt cli::tests::cli_send_stamps_cli_at_node_origin
2026-08-17T23:40:37.4378585Z         PASS [   0.095s] ( 168/2562) spt::bin/spt cli::tests::composite_plans_core_first_and_core_only_skips_adapters
2026-08-17T23:40:37.4415876Z         PASS [   0.099s] ( 169/2562) spt::bin/spt cli::tests::connection_lines_net_less_hides_stale_heartbeat
2026-08-17T23:40:37.4544216Z         PASS [   0.069s] ( 170/2562) spt::bin/spt cli::tests::coordinator_image_line_is_the_only_stale_warning
2026-08-17T23:40:37.4590749Z         PASS [   0.053s] ( 171/2562) spt::bin/spt cli::tests::create_existing_name_is_usage_error
2026-08-17T23:40:37.4681697Z         PASS [   0.059s] ( 172/2562) spt::bin/spt cli::tests::create_mints_two_distinct_keys_and_records_the_mode
2026-08-17T23:40:37.4739036Z         PASS [   0.056s] ( 173/2562) spt::bin/spt cli::tests::create_mode_is_never_preselected
2026-08-17T23:40:37.4786696Z         PASS [   0.050s] ( 174/2562) spt::bin/spt cli::tests::create_new_existing_name_is_usage_error
2026-08-17T23:40:37.4972945Z         PASS [   0.067s] ( 175/2562) spt::bin/spt cli::tests::create_not_elevated_refuses_without_saving
2026-08-17T23:40:37.5061142Z         PASS [   0.076s] ( 176/2562) spt::bin/spt cli::tests::create_new_mints_shows_and_requests_save
2026-08-17T23:40:37.5139087Z         PASS [   0.280s] ( 177/2562) spt::bin/spt cli::tests::apply_release_crc_swap_only_swaps_changed
2026-08-17T23:40:37.5154744Z         PASS [   0.151s] ( 178/2562) spt::bin/spt api::startup::tests::a_recycled_owner_pid_no_longer_refuses_the_bind
2026-08-17T23:40:37.5179763Z         PASS [   0.084s] ( 179/2562) spt::bin/spt cli::tests::create_prints_joining_material_when_elevated
2026-08-17T23:40:37.5189285Z         PASS [   0.077s] ( 180/2562) spt::bin/spt cli::tests::cross_node_after_filters_a_sealed_turn_exactly_like_the_local_path
2026-08-17T23:40:37.5192759Z         PASS [   0.065s] ( 181/2562) spt::bin/spt cli::tests::daemon_offline_hint_only_when_down
2026-08-17T23:40:37.5454972Z         PASS [   0.108s] ( 182/2562) spt::bin/spt cli::tests::create_provisions_the_admin_key_and_show_code_never_does
2026-08-17T23:40:37.5674845Z         PASS [   0.062s] ( 183/2562) spt::bin/spt cli::tests::digest_flag_defaults
2026-08-17T23:40:37.5748649Z         PASS [   0.101s] ( 184/2562) spt::bin/spt cli::tests::daemonless_apply_message_points_at_finish_or_start
2026-08-17T23:40:37.5799397Z         PASS [   0.101s] ( 185/2562) spt::bin/spt cli::tests::deferred_elevation_gate_matrix
2026-08-17T23:40:37.5826855Z         PASS [   0.115s] ( 186/2562) spt::bin/spt cli::tests::daemon_subcommands_parse
2026-08-17T23:40:37.5875000Z         PASS [   0.090s] ( 187/2562) spt::bin/spt cli::tests::digest_cursor_flags_parse
2026-08-17T23:40:37.5920174Z         PASS [   0.133s] ( 188/2562) spt::bin/spt cli::tests::daemon_refresh_verb_parses
2026-08-17T23:40:37.5949295Z         PASS [   0.081s] ( 189/2562) spt::bin/spt cli::tests::digest_human_path_keeps_the_stderr_trailer
2026-08-17T23:40:37.6039709Z         PASS [   3.428s] ( 190/2562) spt::bin/spt cli::reserved_id_tests::rename_into_the_reserved_id_is_refused
2026-08-17T23:40:37.6047372Z         PASS [   0.087s] ( 191/2562) spt::bin/spt cli::tests::digest_json_carries_version_and_leaves_stderr_clean
2026-08-17T23:40:37.6095068Z         PASS [   0.091s] ( 192/2562) spt::bin/spt cli::tests::digest_json_predates_path_still_carries_version
2026-08-17T23:40:37.6145598Z         PASS [   0.095s] ( 193/2562) spt::bin/spt cli::tests::empty_store_no_flag_guides_to_pair_or_create
2026-08-17T23:40:37.6194714Z         PASS [   0.074s] ( 194/2562) spt::bin/spt cli::tests::endpoint_caller_is_denied_and_a_human_caller_is_not
2026-08-17T23:40:37.6332630Z         PASS [   0.058s] ( 195/2562) spt::bin/spt cli::tests::endpoint_role_parses
2026-08-17T23:40:37.6349152Z         PASS [   0.055s] ( 196/2562) spt::bin/spt cli::tests::endpoint_row_json_endpoint_type_is_additive
2026-08-17T23:40:37.6488294Z         PASS [   0.057s] ( 197/2562) spt::bin/spt cli::tests::engine_room_ceremony_decision_table
2026-08-17T23:40:37.6532835Z         PASS [   0.058s] ( 198/2562) spt::bin/spt cli::tests::engine_room_purge_resets_under_elevation_and_refuses_without_it
2026-08-17T23:40:37.6583456Z         PASS [   0.054s] ( 199/2562) spt::bin/spt cli::tests::escalation_choice_parses_fail_closed
2026-08-17T23:40:37.6647355Z         PASS [   0.077s] ( 200/2562) spt::bin/spt cli::tests::endpoint_subcommands_parse
2026-08-17T23:40:37.6661445Z         PASS [   0.061s] ( 201/2562) spt::bin/spt cli::tests::every_mint_persist_site_asks_the_shared_probe
2026-08-17T23:40:37.6868462Z         PASS [   0.171s] ( 202/2562) spt::bin/spt api::startup::tests::a_recycled_relay_pid_is_fixed_too_so_the_role_gate_is_not_carrying_this
2026-08-17T23:40:37.6874792Z         PASS [   0.067s] ( 203/2562) spt::bin/spt cli::tests::every_send_outcome_is_answered_by_exactly_one_renderer
2026-08-17T23:40:37.6980118Z         PASS [   0.083s] ( 204/2562) spt::bin/spt cli::tests::every_read_status_command_accepts_the_global_json_flag
2026-08-17T23:40:37.7168367Z         PASS [   0.063s] ( 205/2562) spt::bin/spt cli::tests::fetch_reject_action_apply_decision
2026-08-17T23:40:37.7172380Z         PASS [   0.108s] ( 206/2562) spt::bin/spt cli::tests::every_node_subcommand_parses_identically_under_the_daemon_alias
2026-08-17T23:40:37.7181810Z         PASS [   0.564s] ( 207/2562) spt::bin/spt cli::tests::an_engine_room_reset_wipes_records_but_never_deletes_the_engine_room
2026-08-17T23:40:37.7221919Z         PASS [   0.064s] ( 208/2562) spt::bin/spt cli::tests::filter_after_excludes_at_or_below_cursor
2026-08-17T23:40:37.7669001Z         PASS [   0.102s] ( 209/2562) spt::bin/spt cli::tests::filter_after_predates_window_returns_full
2026-08-17T23:40:37.7731493Z         PASS [   0.107s] ( 210/2562) spt::bin/spt cli::tests::finish_message_states_fully_live_no_manual_restart
2026-08-17T23:40:37.7736526Z         PASS [   0.191s] ( 211/2562) spt::bin/spt cli::tests::endpoint_stop_marks_offline
2026-08-17T23:40:37.7902520Z         PASS [   0.092s] ( 212/2562) spt::bin/spt cli::tests::gh_download_command_no_tag_omits_tag
2026-08-17T23:40:37.7957265Z         PASS [   0.079s] ( 213/2562) spt::bin/spt cli::tests::gh_download_command_with_tag_shape
2026-08-17T23:40:37.8011483Z         PASS [   0.084s] ( 214/2562) spt::bin/spt cli::tests::gh_failure_classes_render_os_correct_hints
2026-08-17T23:40:37.8051859Z         PASS [   0.170s] ( 215/2562) spt::bin/spt cli::tests::extract_multiplatform_missing_my_triple_is_typed_rejection
2026-08-17T23:40:37.8065326Z         PASS [   0.088s] ( 216/2562) spt::bin/spt cli::tests::gh_release_version_compare_decision
2026-08-17T23:40:37.8074984Z         PASS [   0.174s] ( 217/2562) spt::bin/spt cli::tests::extract_legacy_flat_stays_flat
2026-08-17T23:40:37.8119979Z         PASS [   0.090s] ( 218/2562) spt::bin/spt cli::tests::gh_version_command_shape
2026-08-17T23:40:37.8247284Z         PASS [   0.058s] ( 219/2562) spt::bin/spt cli::tests::grant_subcommands_parse
2026-08-17T23:40:37.8247933Z         PASS [   0.176s] ( 220/2562) spt::bin/spt cli::tests::extract_multiplatform_places_shared_root_and_flattens_my_triple
2026-08-17T23:40:37.8307915Z         PASS [   0.058s] ( 221/2562) spt::bin/spt cli::tests::help_groups_cover_every_command
2026-08-17T23:40:37.9454820Z         PASS [   0.258s] ( 222/2562) spt::bin/spt api::startup::tests::api_bind_admits_the_reserved_id_only_as_a_bring_ups_completion
2026-08-17T23:40:38.1936214Z         PASS [   0.398s] ( 223/2562) spt::bin/spt cli::tests::inbound_json_speaks_in_the_two_states_the_human_view_is_silent_in
2026-08-17T23:40:38.1960168Z         PASS [   0.406s] ( 224/2562) spt::bin/spt cli::tests::how_to_topics_cover_ready_and_send
2026-08-17T23:40:38.2003513Z         PASS [   0.399s] ( 225/2562) spt::bin/spt cli::tests::inbound_verdict_rides_the_json_in_every_state_including_ok
2026-08-17T23:40:38.2049235Z         PASS [   0.431s] ( 226/2562) spt::bin/spt cli::tests::hot_path_flat_and_moved_verbs_gone
2026-08-17T23:40:38.2111719Z         PASS [   0.405s] ( 227/2562) spt::bin/spt cli::tests::install_platform_check_gates_stamp_and_host_arch
2026-08-17T23:40:38.2158995Z         PASS [   0.408s] ( 228/2562) spt::bin/spt cli::tests::instance_rows_palette_and_align
2026-08-17T23:40:38.2176668Z         PASS [   0.412s] ( 229/2562) spt::bin/spt cli::tests::install_place_is_idempotent_and_path_block_detected
2026-08-17T23:40:38.2642051Z         PASS [   0.452s] ( 230/2562) spt::bin/spt cli::tests::instance_rows_project_column
2026-08-17T23:40:38.2715970Z         PASS [   0.447s] ( 231/2562) spt::bin/spt cli::tests::join_gate_refuses_without_confirmed_elevation
2026-08-17T23:40:38.2810773Z         PASS [   0.450s] ( 232/2562) spt::bin/spt cli::tests::json_activity_key_is_local_only_and_skips_when_unknown
2026-08-17T23:40:38.2841324Z         PASS [   0.459s] ( 233/2562) spt::bin/spt cli::tests::invalid_usage_errors
2026-08-17T23:40:38.2931486Z         PASS [   0.099s] ( 234/2562) spt::bin/spt cli::tests::json_activity_words_come_from_the_shared_vocabulary_source
2026-08-17T23:40:38.2997846Z         PASS [   0.103s] ( 235/2562) spt::bin/spt cli::tests::json_payload_rides_as_attr_alongside_body
2026-08-17T23:40:38.3053833Z         PASS [   0.105s] ( 236/2562) spt::bin/spt cli::tests::json_project_field_skip_if_none
2026-08-17T23:40:38.3195272Z         PASS [   0.115s] ( 237/2562) spt::bin/spt cli::tests::knock_surfaces_speaks_the_tables_vocabulary_and_refuses_the_rest
2026-08-17T23:40:38.3235367Z         PASS [   0.107s] ( 238/2562) spt::bin/spt cli::tests::malformed_tuple_flags_refuse_with_a_usable_diagnostic
2026-08-17T23:40:38.3237885Z         PASS [   0.113s] ( 239/2562) spt::bin/spt cli::tests::local_dtos_carry_host_error_and_omit_it_when_clean
2026-08-17T23:40:38.3464711Z         PASS [   0.075s] ( 240/2562) spt::bin/spt cli::tests::new_code_carries_the_acknowledgment_and_the_subnet_through_the_router
2026-08-17T23:40:38.3473652Z         PASS [   0.066s] ( 241/2562) spt::bin/spt cli::tests::no_redeem_surface_claims_a_reverse_the_minting_side_could_not_open
2026-08-17T23:40:38.3479749Z         PASS [   0.084s] ( 242/2562) spt::bin/spt cli::tests::multi_subnet_refuses_without_flag_then_resolves_with_it
2026-08-17T23:40:38.3523019Z         PASS [   0.068s] ( 243/2562) spt::bin/spt cli::tests::node_group_discards_self_and_skips_empty
2026-08-17T23:40:38.3557824Z         PASS [   0.063s] ( 244/2562) spt::bin/spt cli::tests::node_group_freshest_epoch_wins_and_unions_subnets
2026-08-17T23:40:38.3569616Z         PASS [   0.139s] ( 245/2562) spt::bin/spt cli::tests::monic_verbs_parse
2026-08-17T23:40:38.3627266Z         PASS [   0.063s] ( 246/2562) spt::bin/spt cli::tests::node_group_same_id_two_nodes_two_groups
2026-08-17T23:40:38.3684453Z         PASS [   0.063s] ( 247/2562) spt::bin/spt cli::tests::node_grouped_render_structure_and_palette
2026-08-17T23:40:38.3732289Z         PASS [   0.054s] ( 248/2562) spt::bin/spt cli::tests::node_level_label_names_an_endpointless_peer
2026-08-17T23:40:38.3786057Z         PASS [   0.055s] ( 249/2562) spt::bin/spt cli::tests::node_rows_disambiguate_only_on_label_collision
2026-08-17T23:40:38.3838168Z         PASS [   0.060s] ( 250/2562) spt::bin/spt cli::tests::node_status_rows_denominator_counts_routable_only
2026-08-17T23:40:38.3890163Z         PASS [   0.043s] ( 251/2562) spt::bin/spt cli::tests::node_status_rows_settle_cheap_signals_probe_only_stale
2026-08-17T23:40:38.3939881Z         PASS [   0.047s] ( 252/2562) spt::bin/spt cli::tests::not_elevated_refuses_without_leaking_code_or_saving
2026-08-17T23:40:38.3983498Z         PASS [   0.050s] ( 253/2562) spt::bin/spt cli::tests::notify_subnet_resolution_home_default
2026-08-17T23:40:38.4075719Z         PASS [   0.052s] ( 254/2562) spt::bin/spt cli::tests::only_a_bake_that_can_admit_the_whole_node_demands_the_acknowledgment
2026-08-17T23:40:38.4122145Z         PASS [   0.060s] ( 255/2562) spt::bin/spt cli::tests::notify_surface_parses
2026-08-17T23:40:38.4128383Z         PASS [   0.056s] ( 256/2562) spt::bin/spt cli::tests::only_rows_with_a_node_are_asked_and_answers_land_on_their_own_row
2026-08-17T23:40:38.4161864Z         PASS [   0.053s] ( 257/2562) spt::bin/spt cli::tests::only_the_send_side_defaults_to_msg
2026-08-17T23:40:38.4644006Z         PASS [   0.096s] ( 258/2562) spt::bin/spt cli::tests::origin_asset_urls_latest_and_tag
2026-08-17T23:40:38.4685824Z         PASS [   0.095s] ( 259/2562) spt::bin/spt cli::tests::own_nested_section_renders_under_this_node_without_moving_the_total
2026-08-17T23:40:38.4866137Z         PASS [   0.103s] ( 260/2562) spt::bin/spt cli::tests::pair_namespace_is_gone
2026-08-17T23:40:38.4883169Z         PASS [   0.099s] ( 261/2562) spt::bin/spt cli::tests::peer_health_line_names_absent_peers_as_their_own_state
2026-08-17T23:40:38.4924558Z         PASS [   0.098s] ( 262/2562) spt::bin/spt cli::tests::peer_health_line_names_the_stage_and_stays_silent_when_idle
2026-08-17T23:40:38.4963609Z         PASS [   0.098s] ( 263/2562) spt::bin/spt cli::tests::poll_until_ready_fastpath_timeout_and_later_success
2026-08-17T23:40:38.5014652Z         PASS [   0.094s] ( 264/2562) spt::bin/spt cli::tests::post_step_notice_arbitration
2026-08-17T23:40:38.5088883Z         PASS [   0.097s] ( 265/2562) spt::bin/spt cli::tests::probe_all_cap_batches_into_windows
2026-08-17T23:40:38.5217236Z         PASS [   0.057s] ( 266/2562) spt::bin/spt cli::tests::project_index_line_states_health_not_presence
2026-08-17T23:40:38.5277664Z         PASS [   0.059s] ( 267/2562) spt::bin/spt cli::tests::prune_candidates_resolve_never_guess
2026-08-17T23:40:38.5363786Z         PASS [   0.050s] ( 268/2562) spt::bin/spt cli::tests::psyche_companion_is_named_without_a_status
2026-08-17T23:40:38.5820061Z         PASS [   0.050s] ( 269/2562) spt::bin/spt cli::tests::remote_cell_project_ref_from_gossiped_recent_projects
2026-08-17T23:40:38.5979425Z         PASS [   0.061s] ( 270/2562) spt::bin/spt cli::tests::requesting_verbs_force_an_explicit_directionality
2026-08-17T23:40:38.6037407Z         PASS [   0.095s] ( 271/2562) spt::bin/spt cli::tests::registered_github_home_detects_active_collision
2026-08-17T23:40:38.6219104Z         PASS [   0.125s] ( 272/2562) spt::bin/spt cli::tests::purge_offline_gate_and_self_guard
2026-08-17T23:40:38.6308577Z         PASS [   0.033s] ( 273/2562) spt::bin/spt cli::tests::resolve_transport_auto_follows_probe
2026-08-17T23:40:38.6362922Z         PASS [   0.032s] ( 274/2562) spt::bin/spt cli::tests::resolve_transport_explicit_never_probes
2026-08-17T23:40:38.6378865Z         PASS [   0.060s] ( 275/2562) spt::bin/spt cli::tests::resolve_proof_target_override_reads_on_disk
2026-08-17T23:40:38.6426716Z         PASS [   0.021s] ( 276/2562) spt::bin/spt cli::tests::rest_filter_hides_suspended_shows_all_and_corrupt_always
2026-08-17T23:40:38.6471773Z         PASS [   0.017s] ( 277/2562) spt::bin/spt cli::tests::rest_filter_status_first_ordering
2026-08-17T23:40:38.6509458Z         PASS [   0.015s] ( 278/2562) spt::bin/spt cli::tests::rest_filter_total_disclosure_and_corrupt_annotation
2026-08-17T23:40:38.6586612Z         PASS [   0.170s] ( 279/2562) spt::bin/spt cli::tests::public_help_carries_no_internal_codes_at_any_ruled_site
2026-08-17T23:40:38.6711682Z         PASS [   0.255s] ( 280/2562) spt::bin/spt cli::tests::probe_all_timeout_settles_false_without_stalling_batch
2026-08-17T23:40:38.7059265Z         PASS [   0.068s] ( 281/2562) spt::bin/spt cli::tests::restart_plans_lethal_leg_last
2026-08-17T23:40:38.7117749Z         PASS [   0.069s] ( 282/2562) spt::bin/spt cli::tests::ring_no_reply_arms_report_the_wait_in_the_callers_unit
2026-08-17T23:40:38.7148560Z         PASS [   0.301s] ( 283/2562) spt::bin/spt cli::tests::probe_all_runs_concurrently_in_input_order
2026-08-17T23:40:38.7204333Z         PASS [   0.073s] ( 284/2562) spt::bin/spt cli::tests::ring_timeout_defaults
2026-08-17T23:40:38.7231789Z         PASS [   0.072s] ( 285/2562) spt::bin/spt cli::tests::ring_timeout_parses_bare_as_minutes_and_honors_suffixes
2026-08-17T23:40:38.7375807Z         PASS [   0.066s] ( 286/2562) spt::bin/spt cli::tests::self_endpoint_line_reports_the_live_relay_or_says_there_is_none
2026-08-17T23:40:38.7442712Z         PASS [   0.038s] ( 287/2562) spt::bin/spt cli::tests::self_pin_annotates_host_error
2026-08-17T23:40:38.7551324Z         PASS [   0.233s] ( 288/2562) spt::bin/spt cli::tests::release_archive_extracts_to_a_registrable_root
2026-08-17T23:40:38.7607192Z         PASS [   0.048s] ( 289/2562) spt::bin/spt cli::tests::self_pin_annotates_psyche_host_failure
2026-08-17T23:40:38.7705180Z         PASS [   0.056s] ( 290/2562) spt::bin/spt cli::tests::self_pin_annotates_translation_fault
2026-08-17T23:40:38.7808291Z         PASS [   0.061s] ( 291/2562) spt::bin/spt cli::tests::self_pin_includes_description_when_present
2026-08-17T23:40:38.7820526Z         PASS [   0.123s] ( 292/2562) spt::bin/spt cli::tests::run_bounded_yields_value_or_timeout_default
2026-08-17T23:40:38.8002765Z         PASS [   0.077s] ( 293/2562) spt::bin/spt cli::tests::send_reply_to_flag_is_removed_and_target_required
2026-08-17T23:40:38.8054486Z         PASS [   0.068s] ( 294/2562) spt::bin/spt cli::tests::send_user_msg_flag_parses
2026-08-17T23:40:38.8899788Z         PASS [   0.084s] ( 295/2562) spt::bin/spt cli::tests::shell_subcommands_parse
2026-08-17T23:40:38.9721327Z         PASS [   0.217s] ( 296/2562) spt::bin/spt cli::tests::shell_owner_exclusivity_negatives
2026-08-17T23:40:38.9960016Z         PASS [   0.196s] ( 297/2562) spt::bin/spt cli::tests::shell_spawn_profiled_option_resolves_and_shares_cap
2026-08-17T23:40:39.0084176Z         PASS [   0.118s] ( 298/2562) spt::bin/spt cli::tests::show_code_prints_reprovisioning_material
2026-08-17T23:40:39.1358302Z         PASS [   0.374s] ( 299/2562) spt::bin/spt cli::tests::shell_relink_relaunches_offline_instances_only
2026-08-17T23:40:39.1511992Z         PASS [   0.142s] ( 300/2562) spt::bin/spt cli::tests::shutdown_on_a_harness_hosted_endpoint_claims_no_process
2026-08-17T23:40:39.1622166Z         PASS [   0.381s] ( 301/2562) spt::bin/spt cli::tests::shell_spawn_cap_and_over_cap_gates
2026-08-17T23:40:39.1876953Z         PASS [   1.242s] ( 302/2562) spt::bin/spt api::startup::tests::api_listen_admits_the_reserved_id_only_as_a_bring_ups_completion
2026-08-17T23:40:39.2234333Z         PASS [   0.227s] ( 303/2562) spt::bin/spt cli::tests::shutdown_on_a_broker_hosted_endpoint_stamps_after_the_reap
2026-08-17T23:40:39.2518223Z         PASS [   0.280s] ( 304/2562) spt::bin/spt cli::tests::shutdown_and_stop_share_the_postcondition_and_differ_only_in_ceremony
2026-08-17T23:40:39.3721561Z         PASS [   0.627s] ( 305/2562) spt::bin/spt cli::tests::shell_channels_relay_sensory_and_text_file
2026-08-17T23:40:39.3894818Z         PASS [   0.618s] ( 306/2562) spt::bin/spt cli::tests::shell_spawn_approval_floor_gates
2026-08-17T23:40:39.4251448Z         PASS [   0.289s] ( 307/2562) spt::bin/spt cli::tests::single_subnet_auto_selects_and_code_matches_seed
2026-08-17T23:40:39.4254311Z         PASS [   0.054s] ( 308/2562) spt::bin/spt cli::tests::stall_evict_line_surfaces_only_a_real_tally
2026-08-17T23:40:39.4311378Z         PASS [   0.042s] ( 309/2562) spt::bin/spt cli::tests::stop_guard_refuses_live_sessions_without_force
2026-08-17T23:40:39.5286621Z         PASS [   0.097s] ( 310/2562) spt::bin/spt cli::tests::subnet_mode_lines_state_declared_captured_and_pending
2026-08-17T23:40:39.5331271Z         PASS [   0.345s] ( 311/2562) spt::bin/spt api::startup::tests::bind_assigns_home_and_revive_preserves_it
2026-08-17T23:40:39.5410768Z         PASS [   0.116s] ( 312/2562) spt::bin/spt cli::tests::subcommands_parse
2026-08-17T23:40:39.5415747Z         PASS [   0.116s] ( 313/2562) spt::bin/spt cli::tests::subnet_arg_shapes_parse
2026-08-17T23:40:39.5429867Z         PASS [   0.381s] ( 314/2562) spt::bin/spt cli::tests::stage_then_swap_failed_fetch_preserves_install
2026-08-17T23:40:39.6096428Z         PASS [   0.459s] ( 315/2562) spt::bin/spt cli::tests::spt_hosted_no_relay_detection
2026-08-17T23:40:39.6156563Z         PASS [   0.087s] ( 316/2562) spt::bin/spt cli::tests::subnet_status_renders_rows_and_hints_never_secrets
2026-08-17T23:40:39.6184621Z         PASS [   0.078s] ( 317/2562) spt::bin/spt cli::tests::subnets_joined_banner_renders_rows_and_divider
2026-08-17T23:40:39.6336162Z         PASS [   0.092s] ( 318/2562) spt::bin/spt cli::tests::subprocess_detail_prefers_stderr_then_stdout
2026-08-17T23:40:39.6380717Z         PASS [   0.094s] ( 319/2562) spt::bin/spt cli::tests::the_bare_form_is_the_send_form
2026-08-17T23:40:39.6482078Z         PASS [   0.033s] ( 320/2562) spt::bin/spt cli::tests::the_bare_node_verb_defaults_to_the_status_view_under_both_spellings
2026-08-17T23:40:39.6485939Z         PASS [   0.039s] ( 321/2562) spt::bin/spt cli::tests::the_bare_form_refuses_rather_than_guessing
2026-08-17T23:40:39.6553709Z         PASS [   2.088s] ( 322/2562) spt::bin/spt cli::tests::endpoint_role_overwrite_is_the_sole_writer
2026-08-17T23:40:39.6578539Z         PASS [   0.406s] ( 323/2562) spt::bin/spt cli::tests::staged_floor_refuses_above_floor_and_leaves_dest_untouched
2026-08-17T23:40:39.6588867Z         PASS [   0.435s] ( 324/2562) spt::bin/spt cli::tests::staged_floor_admits_when_core_meets_floor
2026-08-17T23:40:39.6605491Z         PASS [   0.042s] ( 325/2562) spt::bin/spt cli::tests::the_bare_status_view_states_the_mode_facts_for_every_row
2026-08-17T23:40:39.6817509Z         PASS [   0.048s] ( 326/2562) spt::bin/spt cli::tests::the_briefing_prescribes_only_verbs_the_grammar_has
2026-08-17T23:40:39.6870670Z         PASS [   0.154s] ( 327/2562) spt::bin/spt api::startup::tests::bind_gateway_earns_no_online_stamp
2026-08-17T23:40:39.7311989Z         PASS [   0.083s] ( 328/2562) spt::bin/spt cli::tests::the_cross_node_mutual_refusal_is_gone_from_every_surface_that_carried_it
2026-08-17T23:40:39.7323937Z         PASS [   0.095s] ( 329/2562) spt::bin/spt cli::tests::the_create_ceremony_names_the_heal_for_an_older_minter
2026-08-17T23:40:39.7445385Z         PASS [   0.087s] ( 330/2562) spt::bin/spt cli::tests::the_engine_room_briefing_speaks_the_cli_vocabulary
2026-08-17T23:40:39.7460740Z         PASS [   0.098s] ( 331/2562) spt::bin/spt cli::tests::the_denial_names_the_blast_radius_and_a_cure_that_fits_its_ground
2026-08-17T23:40:39.7621072Z         PASS [   0.080s] ( 332/2562) spt::bin/spt cli::tests::the_gc_render_says_what_it_refused_and_what_it_would_delete
2026-08-17T23:40:39.7621854Z         PASS [   0.107s] ( 333/2562) spt::bin/spt cli::tests::the_deprecation_note_renders_on_both_spellings_of_the_node_verb
2026-08-17T23:40:39.7788372Z         PASS [   0.048s] ( 334/2562) spt::bin/spt cli::tests::the_human_and_json_legs_agree_on_every_unlisted_row
2026-08-17T23:40:39.7834759Z         PASS [   0.123s] ( 335/2562) spt::bin/spt cli::tests::the_flagless_access_listing_is_wired_distinctly_from_its_subcommands
2026-08-17T23:40:39.7835707Z         PASS [   0.051s] ( 336/2562) spt::bin/spt cli::tests::the_legacy_allow_echo_says_discover_is_untouched_and_scopes_both_levers
2026-08-17T23:40:39.7868190Z         PASS [   1.294s] ( 337/2562) spt::bin/spt cli::tests::purge_force_asks_before_it_tears_anything_down
2026-08-17T23:40:39.7932105Z         PASS [   0.047s] ( 338/2562) spt::bin/spt cli::tests::the_mint_probe_answers_only_for_a_fresh_mint
2026-08-17T23:40:39.7962775Z         PASS [   0.034s] ( 339/2562) spt::bin/spt cli::tests::the_presenters_three_renderings_stay_three_things
2026-08-17T23:40:39.8156150Z         PASS [   0.157s] ( 340/2562) spt::bin/spt cli::tests::the_evidence_census_reads_each_local_source
2026-08-17T23:40:39.8464678Z         PASS [   0.065s] ( 341/2562) spt::bin/spt cli::tests::the_remote_knock_refusals_render_as_prose
2026-08-17T23:40:39.8525537Z         PASS [   0.069s] ( 342/2562) spt::bin/spt cli::tests::the_rendered_peer_fraction_counts_one_population_across_a_subnet_leave
2026-08-17T23:40:39.8804646Z         PASS [   0.096s] ( 343/2562) spt::bin/spt cli::tests::the_rendered_section_is_the_composers_output
2026-08-17T23:40:39.8847742Z         PASS [   0.088s] ( 344/2562) spt::bin/spt cli::tests::the_three_landings_render_distinct_lines
2026-08-17T23:40:39.8886530Z         PASS [   0.073s] ( 345/2562) spt::bin/spt cli::tests::the_three_send_outcomes_owe_three_different_receipts
2026-08-17T23:40:39.9044312Z         PASS [   0.060s] ( 346/2562) spt::bin/spt cli::tests::the_tuple_flags_build_the_rule_they_name
2026-08-17T23:40:39.9249691Z         PASS [   0.040s] ( 347/2562) spt::bin/spt cli::tests::the_visible_alias_reaches_the_root_listing
2026-08-17T23:40:39.9273243Z         PASS [   0.047s] ( 348/2562) spt::bin/spt cli::tests::the_unspooled_remedy_prescribes_a_verb_the_grammar_has
2026-08-17T23:40:39.9285910Z         PASS [   0.076s] ( 349/2562) spt::bin/spt cli::tests::the_unlisted_listing_drops_an_excluded_peer_and_keeps_the_rest
2026-08-17T23:40:39.9322161Z         PASS [   0.028s] ( 350/2562) spt::bin/spt cli::tests::this_node_group_merges_roster_with_unbound_truth
2026-08-17T23:40:39.9459779Z         PASS [   0.021s] ( 351/2562) spt::bin/spt cli::tests::trust_mutation_gate_refuses_without_confirmed_elevation
2026-08-17T23:40:39.9553946Z         PASS [   0.067s] ( 352/2562) spt::bin/spt cli::tests::the_widening_remedy_is_sited_with_its_flag_not_in_the_shared_section
2026-08-17T23:40:39.9585391Z         PASS [   0.030s] ( 353/2562) spt::bin/spt cli::tests::unknown_elevation_falls_back
2026-08-17T23:40:39.9622721Z         PASS [   0.035s] ( 354/2562) spt::bin/spt cli::tests::trust_warning_verbs_parse
2026-08-17T23:40:39.9649685Z         PASS [   0.033s] ( 355/2562) spt::bin/spt cli::tests::unknown_named_subnet_is_usage_error
2026-08-17T23:40:39.9723880Z         PASS [   0.026s] ( 356/2562) spt::bin/spt cli::tests::update_adapters_verb_parses_with_optional_names
2026-08-17T23:40:39.9770919Z         PASS [   0.022s] ( 357/2562) spt::bin/spt cli::tests::update_fetch_apply_flag_parses
2026-08-17T23:40:39.9780801Z         PASS [   0.020s] ( 358/2562) spt::bin/spt cli::tests::what_the_listing_prescribes_is_what_the_approve_path_honors
2026-08-17T23:40:39.9928993Z         PASS [   0.031s] ( 359/2562) spt::bin/spt cli::tests::whoami_parses_as_the_identity_verb
2026-08-17T23:40:40.0101951Z         PASS [   0.045s] ( 360/2562) spt::bin/spt cli::verb_surface_route_table::every_bringup_door_routes_where_it_says
2026-08-17T23:40:40.0160792Z         PASS [   0.223s] ( 361/2562) spt::bin/spt cli::tests::the_surface_section_rides_the_ruled_sites_and_no_others
2026-08-17T23:40:40.0611916Z         PASS [   0.274s] ( 362/2562) spt::bin/spt cli::tests::the_seat_and_the_acknowledgment_are_the_mints_and_both_arms_refuse_alike
2026-08-17T23:40:40.0661876Z         PASS [   0.089s] ( 363/2562) spt::bin/spt elevation::tests::already_elevated_short_circuits_on_every_os
2026-08-17T23:40:40.0704504Z         PASS [   0.077s] ( 364/2562) spt::bin/spt elevation::tests::fallback_message_names_authenticator_app_and_subnet
2026-08-17T23:40:40.0719063Z         PASS [   0.094s] ( 365/2562) spt::bin/spt elevation::tests::current_returns_a_determinate_level_on_supported_platforms
2026-08-17T23:40:40.0741947Z         PASS [   0.064s] ( 366/2562) spt::bin/spt elevation::tests::gate_shows_only_when_confirmed_elevated
2026-08-17T23:40:40.0753782Z         PASS [   0.059s] ( 367/2562) spt::bin/spt elevation::tests::launcher_argv_is_absolute_exe_plus_verbatim_args
2026-08-17T23:40:40.0797445Z         PASS [   0.019s] ( 368/2562) spt::bin/spt elevation::tests::launchers_never_shell_interpolate_a_crafted_arg
2026-08-17T23:40:40.0803034Z         PASS [   0.108s] ( 369/2562) spt::bin/spt cli::verb_surface_route_table::the_exclusions_are_real_refusals
2026-08-17T23:40:40.0849638Z         PASS [   0.019s] ( 370/2562) spt::bin/spt elevation::tests::print_hint_floor_uses_absolute_path_each_os
2026-08-17T23:40:40.0893947Z         PASS [   0.019s] ( 371/2562) spt::bin/spt elevation::tests::unix_path_order_tty_then_pkexec_then_terminal_then_hint
2026-08-17T23:40:40.0951974Z         PASS [   0.023s] ( 372/2562) spt::bin/spt elevation::tests::windows_uac_only_interactive_other_always_prints
2026-08-17T23:40:40.1005821Z         PASS [   0.026s] ( 373/2562) spt::bin/spt helpfmt::tests::atx_header_at_line_start_strips_and_bolds
2026-08-17T23:40:40.1040501Z         PASS [   0.029s] ( 374/2562) spt::bin/spt helpfmt::tests::bold_styles_with_color_and_strips_without
2026-08-17T23:40:40.1132925Z         PASS [   0.034s] ( 375/2562) spt::bin/spt helpfmt::tests::code_styles_with_color_and_strips_without
2026-08-17T23:40:40.1177807Z         PASS [   0.037s] ( 376/2562) spt::bin/spt helpfmt::tests::color_enabled_truth_table
2026-08-17T23:40:40.1218336Z         PASS [   0.037s] ( 377/2562) spt::bin/spt helpfmt::tests::dual_contract_token_survives_strip_mode
2026-08-17T23:40:40.1273935Z         PASS [   0.038s] ( 378/2562) spt::bin/spt helpfmt::tests::dual_contract_token_unstyled_while_prose_styles_on_color
2026-08-17T23:40:40.1348403Z         PASS [   0.040s] ( 379/2562) spt::bin/spt helpfmt::tests::empty_and_unmatched_markers_stay_literal
2026-08-17T23:40:40.1397019Z         PASS [   0.039s] ( 380/2562) spt::bin/spt helpfmt::tests::link_becomes_its_text
2026-08-17T23:40:40.1846285Z         PASS [   0.080s] ( 381/2562) spt::bin/spt helpfmt::tests::marker_never_spans_a_hard_break
2026-08-17T23:40:40.1891949Z         PASS [   0.076s] ( 382/2562) spt::bin/spt helpfmt::tests::marker_spans_a_clap_soft_wrap
2026-08-17T23:40:40.1939105Z         PASS [   0.076s] ( 383/2562) spt::bin/spt helpfmt::tests::multibyte_text_survives
2026-08-17T23:40:40.1978529Z         PASS [   0.076s] ( 384/2562) spt::bin/spt helpfmt::tests::nested_code_inside_bold_styles_both
2026-08-17T23:40:40.2019721Z         PASS [   0.074s] ( 385/2562) spt::bin/spt helpfmt::tests::plain_text_is_unchanged
2026-08-17T23:40:40.2076147Z         PASS [   0.073s] ( 386/2562) spt::bin/spt helpfmt::tests::preexisting_ansi_is_passed_through_untouched
2026-08-17T23:40:40.2121635Z         PASS [   0.072s] ( 387/2562) spt::bin/spt helpfmt::tests::resolve_console_color_strips_when_vt_unavailable
2026-08-17T23:40:40.2174430Z         PASS [   0.033s] ( 388/2562) spt::bin/spt monicverb::tests::add_refuses_to_replace_and_update_refuses_to_invent
2026-08-17T23:40:40.2230018Z         PASS [   0.034s] ( 389/2562) spt::bin/spt monicverb::tests::no_monic_verb_is_elevation_gated
2026-08-17T23:40:40.2273360Z         PASS [   0.033s] ( 390/2562) spt::bin/spt picker::data::tests::disambiguate_project_ids_cases
2026-08-17T23:40:40.2322748Z         PASS [   0.034s] ( 391/2562) spt::bin/spt picker::data::tests::driven_by_display_renders_name_not_hex
2026-08-17T23:40:40.2510601Z         PASS [   0.034s] ( 392/2562) spt::bin/spt picker::data::tests::indexed_projection_full_w2shaped_and_absent_legs
2026-08-17T23:40:40.2572354Z         PASS [   0.034s] ( 393/2562) spt::bin/spt picker::data::tests::non_drivable_predicate_covers_worker_and_psyche
2026-08-17T23:40:40.2714092Z         PASS [   0.020s] ( 394/2562) spt::bin/spt picker::data::tests::project_refs_from_sessions_excludes_owlery_and_dedups_newest_first
2026-08-17T23:40:40.2769682Z         PASS [   0.020s] ( 395/2562) spt::bin/spt picker::data::tests::project_refs_from_unions_fresh_origin_and_store_branches
2026-08-17T23:40:40.2835286Z         PASS [   0.012s] ( 396/2562) spt::bin/spt picker::data::tests::reconcile_overrides_subnet_with_local_roster
2026-08-17T23:40:40.4938981Z         PASS [   0.266s] ( 397/2562) spt::bin/spt picker::data::tests::own_node_tab_label_falls_back_to_keyprefix
2026-08-17T23:40:40.4954376Z         PASS [   0.218s] ( 398/2562) spt::bin/spt picker::data::tests::remote_picker_renders_suspended_dead_perch_offline
2026-08-17T23:40:40.5228009Z         PASS [   0.028s] ( 399/2562) spt::bin/spt picker::data::tests::resume_rows_derive_per_row_project_and_drop_owlery_sessions
2026-08-17T23:40:40.5269421Z         PASS [   0.243s] ( 400/2562) spt::bin/spt picker::data::tests::remote_rows_render_full_palette_parity
2026-08-17T23:40:40.5388507Z         PASS [   0.794s] ( 401/2562) spt::bin/spt cli::tests::the_local_and_wire_arms_write_one_identical_grant
2026-08-17T23:40:40.5477754Z         PASS [   0.052s] ( 402/2562) spt::bin/spt picker::data::tests::resume_rows_title_from_index_cwd_map_with_pure_fallback
2026-08-17T23:40:40.5683001Z         PASS [   0.046s] ( 403/2562) spt::bin/spt picker::data::tests::row_status_drives_unbound_display
2026-08-17T23:40:40.5807503Z         PASS [   0.042s] ( 404/2562) spt::bin/spt picker::model::tests::adapter_tree_nests_profiles
2026-08-17T23:40:40.5936460Z         PASS [   0.046s] ( 405/2562) spt::bin/spt picker::model::tests::back_unwinds
2026-08-17T23:40:40.6018129Z         PASS [   0.390s] ( 406/2562) spt::bin/spt picker::data::tests::home_subnet_options_is_mru_ordered
2026-08-17T23:40:40.6020832Z         PASS [   0.394s] ( 407/2562) spt::bin/spt picker::data::tests::gather_renders_live_unbound
2026-08-17T23:40:40.6110255Z         PASS [   0.043s] ( 408/2562) spt::bin/spt picker::model::tests::build_project_choices_head_here_rest
2026-08-17T23:40:40.6111171Z         PASS [   0.084s] ( 409/2562) spt::bin/spt picker::data::tests::shared_machine_is_one_group_with_unioned_subnets
2026-08-17T23:40:40.6133649Z         PASS [   0.033s] ( 410/2562) spt::bin/spt picker::model::tests::category_labels_render_display_forms
2026-08-17T23:40:40.6168725Z         PASS [   0.415s] ( 411/2562) spt::bin/spt picker::data::tests::gather_endpoints_projects_from_seeded_index_with_zero_git
2026-08-17T23:40:40.6213446Z         PASS [   0.028s] ( 412/2562) spt::bin/spt picker::model::tests::category_ring_wraps
2026-08-17T23:40:40.6258667Z         PASS [   0.024s] ( 413/2562) spt::bin/spt picker::model::tests::change_adapter_picks_and_returns_to_confirm
2026-08-17T23:40:40.6331657Z         PASS [   0.030s] ( 414/2562) spt::bin/spt picker::model::tests::choose_project_outcome_bakes_cwd_and_diverts
2026-08-17T23:40:40.6367825Z         PASS [   0.404s] ( 415/2562) spt::bin/spt picker::data::tests::picker_excludes_flat_worker_and_psyche
2026-08-17T23:40:40.6373141Z         PASS [   0.026s] ( 416/2562) spt::bin/spt picker::model::tests::confirm_local_offline_unchanged_by_wake_split
2026-08-17T23:40:40.6421948Z         PASS [   0.031s] ( 417/2562) spt::bin/spt picker::model::tests::confirm_options_remote_suspended_is_wake_not_start
2026-08-17T23:40:40.6475038Z         PASS [   0.034s] ( 418/2562) spt::bin/spt picker::model::tests::confirm_options_status_dependent
2026-08-17T23:40:40.6521483Z         PASS [   0.035s] ( 419/2562) spt::bin/spt picker::model::tests::confirm_terminal_routes
2026-08-17T23:40:40.6578704Z         PASS [   0.036s] ( 420/2562) spt::bin/spt picker::model::tests::confirm_terminal_wake_carries_raw_node
2026-08-17T23:40:40.6618006Z         PASS [   0.036s] ( 421/2562) spt::bin/spt picker::model::tests::create_new_multisubnet_inserts_home_layer
2026-08-17T23:40:40.7275664Z         PASS [   0.093s] ( 422/2562) spt::bin/spt picker::model::tests::create_outcome_bakes_run
2026-08-17T23:40:40.7292146Z         PASS [   0.092s] ( 423/2562) spt::bin/spt picker::model::tests::cursor_clamps
2026-08-17T23:40:40.7313348Z         PASS [   0.094s] ( 424/2562) spt::bin/spt picker::model::tests::display_mapping_matrix
2026-08-17T23:40:40.7399343Z         PASS [   0.098s] ( 425/2562) spt::bin/spt picker::model::tests::display_status_four_state_type_gated
2026-08-17T23:40:40.7403983Z         PASS [   0.093s] ( 426/2562) spt::bin/spt picker::model::tests::display_status_unbound_is_hollow_and_attachable
2026-08-17T23:40:40.7417552Z         PASS [   0.090s] ( 427/2562) spt::bin/spt picker::model::tests::empty_scope_opens_create
2026-08-17T23:40:40.7447898Z         PASS [   0.087s] ( 428/2562) spt::bin/spt picker::model::tests::ep_display_glyph_and_square_palette
2026-08-17T23:40:40.7484887Z         PASS [   0.087s] ( 429/2562) spt::bin/spt picker::model::tests::esc_backs_out_of_home_layer
2026-08-17T23:40:40.7553514Z         PASS [   0.029s] ( 430/2562) spt::bin/spt picker::model::tests::filter_narrows
2026-08-17T23:40:40.7597891Z         PASS [   0.030s] ( 431/2562) spt::bin/spt picker::model::tests::from_resource_row_maps_gossiped_adapter_projects_controlled
2026-08-17T23:40:40.7658777Z         PASS [   0.034s] ( 432/2562) spt::bin/spt picker::model::tests::home_selection_bakes_into_run_subnet
2026-08-17T23:40:40.7710886Z         PASS [   0.031s] ( 433/2562) spt::bin/spt picker::model::tests::kind_routes
2026-08-17T23:40:40.7764369Z         PASS [   0.036s] ( 434/2562) spt::bin/spt picker::model::tests::launch_keys_live_only_on_launch_capable_highlights
2026-08-17T23:40:40.7816217Z         PASS [   0.040s] ( 435/2562) spt::bin/spt picker::model::tests::prefill_jumps_to_create
2026-08-17T23:40:40.7876706Z         PASS [   0.043s] ( 436/2562) spt::bin/spt picker::model::tests::project_filter_keys_on_slug_while_tab_renders_display
2026-08-17T23:40:40.7925308Z         PASS [   0.044s] ( 437/2562) spt::bin/spt picker::model::tests::purge_confirm_yields_outcome_and_backs_out
2026-08-17T23:40:40.7970666Z         PASS [   0.042s] ( 438/2562) spt::bin/spt picker::model::tests::purge_shortcut_gates_to_offline_local
2026-08-17T23:40:40.8013549Z         PASS [   0.042s] ( 439/2562) spt::bin/spt picker::model::tests::reenter_create_keeps_or_clears_id
2026-08-17T23:40:40.8057925Z         PASS [   0.040s] ( 440/2562) spt::bin/spt picker::model::tests::remove_endpoint_drops_row_and_clamps_cursor
2026-08-17T23:40:40.8545582Z         PASS [   0.083s] ( 441/2562) spt::bin/spt picker::model::tests::resume_outcome_adapter_follows_recorded_row
2026-08-17T23:40:40.8596617Z         PASS [   1.173s] ( 442/2562) spt::bin/spt api::startup::tests::bind_listen_control_detach_keeps_the_earned_hosting_authority
2026-08-17T23:40:40.8600311Z         PASS [   0.084s] ( 443/2562) spt::bin/spt picker::model::tests::resume_outcome_bakes_session
2026-08-17T23:40:40.8650298Z         PASS [   0.083s] ( 444/2562) spt::bin/spt picker::model::tests::resume_title_render
2026-08-17T23:40:40.8684917Z         PASS [   0.081s] ( 445/2562) spt::bin/spt picker::model::tests::should_offer_project_choice_fire_conditions
2026-08-17T23:40:40.8719141Z         PASS [   0.079s] ( 446/2562) spt::bin/spt picker::model::tests::single_subnet_skips_home_layer
2026-08-17T23:40:40.8774383Z         PASS [   0.080s] ( 447/2562) spt::bin/spt picker::model::tests::suspended_is_distinct_from_offline
2026-08-17T23:40:40.8819220Z         PASS [   0.081s] ( 448/2562) spt::bin/spt picker::model::tests::the_picker_refuses_the_reserved_id_as_it_is_typed
2026-08-17T23:40:40.8859987Z         PASS [   0.080s] ( 449/2562) spt::bin/spt picker::model::tests::visible_partitions_and_sorts
2026-08-17T23:40:40.8906120Z         PASS [   0.036s] ( 450/2562) spt::bin/spt picker::shortcut::tests::basename_is_parameterized
2026-08-17T23:40:40.9031805Z         PASS [   0.043s] ( 451/2562) spt::bin/spt picker::shortcut::tests::sentinel_detection_spans_both_generations
2026-08-17T23:40:40.9081958Z         PASS [   0.043s] ( 452/2562) spt::bin/spt picker::shortcut::tests::the_body_is_the_ladder_verb
2026-08-17T23:40:40.9189461Z         PASS [   0.047s] ( 453/2562) spt::bin/spt picker::tests::backspace_backs_out_screens_like_esc
2026-08-17T23:40:40.9246518Z         PASS [   0.047s] ( 454/2562) spt::bin/spt picker::tests::backspace_stays_char_delete_in_text_contexts
2026-08-17T23:40:40.9271439Z         PASS [   0.059s] ( 455/2562) spt::bin/spt picker::shortcut::tests::write_create_update_regenerate_refuse
2026-08-17T23:40:40.9310194Z         PASS [   0.049s] ( 456/2562) spt::bin/spt picker::tests::purge_outcomes_convert_to_flash_lines
2026-08-17T23:40:40.9413003Z         PASS [   0.055s] ( 457/2562) spt::bin/spt picker::tests::purge_transition_reconstructs_the_complete_screen_after_external_mutation
2026-08-17T23:40:40.9432641Z         PASS [   0.053s] ( 458/2562) spt::bin/spt picker::view::tests::adapter_tree_buffer
2026-08-17T23:40:40.9475096Z         PASS [   0.044s] ( 459/2562) spt::bin/spt picker::view::tests::change_adapter_screen_renders_tree_and_apply_legend
2026-08-17T23:40:40.9538298Z         PASS [   0.046s] ( 460/2562) spt::bin/spt picker::view::tests::choose_project_buffer_keeps_confirm_panel
2026-08-17T23:40:40.9628039Z         PASS [   0.038s] ( 461/2562) spt::bin/spt picker::view::tests::confirm_fork_and_shortcut_labels_are_dir_relative
2026-08-17T23:40:40.9664240Z         PASS [   0.047s] ( 462/2562) spt::bin/spt picker::view::tests::confirm_buffer_options
2026-08-17T23:40:40.9731209Z         PASS [   0.042s] ( 463/2562) spt::bin/spt picker::view::tests::create_home_lists_subnets
2026-08-17T23:40:40.9740551Z         PASS [   0.047s] ( 464/2562) spt::bin/spt picker::view::tests::confirm_panel_history_renders_display_not_slug
2026-08-17T23:40:40.9793337Z         PASS [   0.038s] ( 465/2562) spt::bin/spt picker::view::tests::every_picker_list_view_keeps_its_caret_on_screen
2026-08-17T23:40:41.0021688Z         PASS [   0.142s] ( 466/2562) spt::bin/spt api::startup::tests::bind_live_agent_over_prior_ready_agent_earns_online_on_controllable_with_preserved_type
2026-08-17T23:40:41.0342107Z         PASS [   0.086s] ( 467/2562) spt::bin/spt picker::view::tests::kind_buffer
2026-08-17T23:40:41.0419716Z         PASS [   0.088s] ( 468/2562) spt::bin/spt picker::view::tests::pick_buffer_has_squares_and_description
2026-08-17T23:40:41.0462290Z         PASS [   0.083s] ( 469/2562) spt::bin/spt picker::view::tests::pick_empty_category_hint
2026-08-17T23:40:41.0478967Z         PASS [   0.105s] ( 470/2562) spt::bin/spt picker::view::tests::footer_hints_h_s_only_when_launch_keys_live
2026-08-17T23:40:41.0582729Z         PASS [   0.085s] ( 471/2562) spt::bin/spt picker::view::tests::resume_buffer_keeps_confirm_panel
2026-08-17T23:40:41.0628511Z         PASS [   0.089s] ( 472/2562) spt::bin/spt picker::view::tests::resume_buffer_lists_sessions
2026-08-17T23:40:41.0688464Z         PASS [   0.089s] ( 473/2562) spt::bin/spt picker::view::tests::the_caret_row_accounts_for_the_group_headers_above_it
2026-08-17T23:40:41.0807135Z         PASS [   0.039s] ( 474/2562) spt::bin/spt rc::tests::a_bringable_target_reaches_bring_up_with_the_offline_row_present
2026-08-17T23:40:41.0859075Z         PASS [   0.040s] ( 475/2562) spt::bin/spt rc::tests::a_refusal_names_the_targets_own_entry_surface
2026-08-17T23:40:41.0871224Z         PASS [   0.053s] ( 476/2562) spt::bin/spt picker::view::tests::the_caret_stays_on_screen_when_the_list_outruns_the_viewport
2026-08-17T23:40:41.0945416Z         PASS [   0.036s] ( 477/2562) spt::bin/spt rc::tests::attach_gate_routes_on_session_truth_not_the_row
2026-08-17T23:40:41.1035574Z         PASS [   0.137s] ( 478/2562) spt::bin/spt picker::view::tests::pick_status_line_four_state
2026-08-17T23:40:41.1051935Z         PASS [   0.036s] ( 479/2562) spt::bin/spt rc::tests::bracketed_paste_framing_is_exact_and_content_verbatim
2026-08-17T23:40:41.1098446Z         PASS [   0.029s] ( 480/2562) spt::bin/spt rc::tests::bringable_is_the_engine_room_addressed_plainly_with_a_code
2026-08-17T23:40:41.1122436Z         PASS [   0.064s] ( 481/2562) spt::bin/spt rc::tests::attach_against_stopped_daemon_never_spawns_and_exits_loud
2026-08-17T23:40:41.1143323Z         PASS [   0.028s] ( 482/2562) spt::bin/spt rc::tests::bringup_prompt_names_the_node_and_the_home_subnet
2026-08-17T23:40:41.1196635Z         PASS [   0.032s] ( 483/2562) spt::bin/spt rc::tests::canonical_wire_id_strips_qualifiers_to_the_bare_id
2026-08-17T23:40:41.1249189Z         PASS [   0.030s] ( 484/2562) spt::bin/spt rc::tests::classify_read_err_eof_is_graceful_not_fatal
2026-08-17T23:40:41.1292181Z         PASS [   0.026s] ( 485/2562) spt::bin/spt rc::tests::clipboard_paste_wraps_nonempty_and_noops_on_empty_or_failure
2026-08-17T23:40:41.1340338Z         PASS [   0.029s] ( 486/2562) spt::bin/spt rc::tests::detach_keybind_semantics
2026-08-17T23:40:41.1381989Z         PASS [   0.028s] ( 487/2562) spt::bin/spt rc::tests::detach_prefix_spans_chunks
2026-08-17T23:40:41.1427880Z         PASS [   0.080s] ( 488/2562) spt::bin/spt rc::tests::attach_offline_endpoint_short_circuits_clean
2026-08-17T23:40:41.1445856Z         PASS [   0.032s] ( 489/2562) spt::bin/spt rc::tests::display_guard_postlude_exactly_once_and_inactive_silent
2026-08-17T23:40:41.1500911Z         PASS [   0.036s] ( 490/2562) spt::bin/spt rc::tests::driver_phrase_names_own_node_plainly_but_remote_verbatim
2026-08-17T23:40:41.1586150Z         PASS [   0.034s] ( 491/2562) spt::bin/spt rc::tests::first_event_stall_decision
2026-08-17T23:40:41.2136920Z         PASS [   0.084s] ( 492/2562) spt::bin/spt rc::tests::fold_code_key_prompt_rules
2026-08-17T23:40:41.2186042Z         PASS [   0.084s] ( 493/2562) spt::bin/spt rc::tests::give_up_copy_names_daemon_down_vs_generic
2026-08-17T23:40:41.2227652Z         PASS [   0.084s] ( 494/2562) spt::bin/spt rc::tests::harness_only_row_matches_online_seatless_live_agents_only
2026-08-17T23:40:41.2309459Z         PASS [   0.088s] ( 495/2562) spt::bin/spt rc::tests::identity_line_format
2026-08-17T23:40:41.2338063Z         PASS [   0.089s] ( 496/2562) spt::bin/spt rc::tests::key_event_step_detach_sm
2026-08-17T23:40:41.2398862Z         PASS [   0.090s] ( 497/2562) spt::bin/spt rc::tests::mouse_is_paste_only_right_button_down
2026-08-17T23:40:41.2461763Z         PASS [   0.087s] ( 498/2562) spt::bin/spt rc::tests::mouse_mode_decset_scan_survives_split_across_chunks
2026-08-17T23:40:41.2525073Z         PASS [   0.039s] ( 499/2562) spt::bin/spt rc::tests::mouse_mode_decset_scan_tracks_enable_and_sgr
2026-08-17T23:40:41.2587025Z         PASS [   0.040s] ( 500/2562) spt::bin/spt rc::tests::op_minter_distinct_and_monotonic
2026-08-17T23:40:41.2633390Z         PASS [   0.040s] ( 501/2562) spt::bin/spt rc::tests::pre_broker_busy_guidance_fires_for_any_driver_not_just_remote
2026-08-17T23:40:41.2669557Z         PASS [   0.265s] ( 502/2562) spt::bin/spt api::startup::tests::bind_records_cwd_so_picker_can_group_by_project
2026-08-17T23:40:41.2703061Z         PASS [   0.039s] ( 503/2562) spt::bin/spt rc::tests::public_attach_failure_maps_deadline_class_only
2026-08-17T23:40:41.2741423Z         PASS [   0.040s] ( 504/2562) spt::bin/spt rc::tests::pump_status_emit_sequence_over_write_sink
2026-08-17T23:40:41.2798259Z         PASS [   0.040s] ( 505/2562) spt::bin/spt rc::tests::reassert_scanner_survives_split_across_chunks
2026-08-17T23:40:41.2865085Z         PASS [   0.040s] ( 506/2562) spt::bin/spt rc::tests::reassert_scanner_triggers_only_on_region_destroyers
2026-08-17T23:40:41.2934077Z         PASS [   0.041s] ( 507/2562) spt::bin/spt rc::tests::reconnect_banner_clears_and_centers
2026-08-17T23:40:41.2977237Z         PASS [   0.039s] ( 508/2562) spt::bin/spt rc::tests::reconnect_banner_shows_the_countdown
2026-08-17T23:40:41.2982329Z         PASS [   0.179s] ( 509/2562) spt::bin/spt rc::tests::establish_attach_reuses_the_probes_carried_pump_conn
2026-08-17T23:40:41.3029911Z         PASS [   0.040s] ( 510/2562) spt::bin/spt rc::tests::reconnect_remaining_secs_counts_down_ceil
2026-08-17T23:40:41.3126719Z         PASS [   0.042s] ( 511/2562) spt::bin/spt rc::tests::reconnect_window_expiry_decision
2026-08-17T23:40:41.3293518Z         PASS [   0.062s] ( 512/2562) spt::bin/spt api::startup::tests::bind_refuses_a_session_id_that_squats_a_psyche_custody_sid
2026-08-17T23:40:41.3634633Z         PASS [   0.089s] ( 513/2562) spt::bin/spt rc::tests::scroll_dir_classifies_wheel_only
2026-08-17T23:40:41.3712047Z         PASS [   0.091s] ( 514/2562) spt::bin/spt rc::tests::scroll_sgr_emits_exact_xterm_bytes
2026-08-17T23:40:41.3748007Z         PASS [   0.088s] ( 515/2562) spt::bin/spt rc::tests::serve_eof_severed_vs_refused
2026-08-17T23:40:41.3807785Z         PASS [   0.087s] ( 516/2562) spt::bin/spt rc::tests::status_assert_reserves_row1_then_repaints
2026-08-17T23:40:41.4003291Z         PASS [   0.102s] ( 517/2562) spt::bin/spt rc::tests::status_repaint_exact_bytes_and_right_align
2026-08-17T23:40:41.4064899Z         PASS [   0.108s] ( 518/2562) spt::bin/spt rc::tests::status_restore_exact_bytes
2026-08-17T23:40:41.4113559Z         PASS [   0.108s] ( 519/2562) spt::bin/spt rc::tests::status_row_marker_is_disabled_by_flag
2026-08-17T23:40:41.4156273Z         PASS [   0.103s] ( 520/2562) spt::bin/spt rc::tests::status_update_size_repoints_geometry
2026-08-17T23:40:41.4288190Z         PASS [   0.065s] ( 521/2562) spt::bin/spt rc::tests::teardown_matrix_postlude_precedes_prose_across_every_final_class
2026-08-17T23:40:41.4338779Z         PASS [   0.063s] ( 522/2562) spt::bin/spt rc::tests::the_client_refuses_engine_room_viewports_and_qualified_targets_only
2026-08-17T23:40:41.4387751Z         PASS [   0.064s] ( 523/2562) spt::bin/spt rc::tests::translate_key_event_emits_exact_xterm_vt
2026-08-17T23:40:41.4455625Z         PASS [   0.065s] ( 524/2562) spt::bin/spt rc::tests::with_vt_output_disables_newline_auto_return
2026-08-17T23:40:41.4501842Z         PASS [   0.050s] ( 525/2562) spt::bin/spt rc::tests::with_vt_output_enables_virtual_terminal_processing
2026-08-17T23:40:41.4863613Z         PASS [   0.080s] ( 526/2562) spt::bin/spt roster::tests::detect_self_by_ancestry_none_when_no_ancestor_owns_a_perch
2026-08-17T23:40:41.5003055Z         PASS [   0.085s] ( 527/2562) spt::bin/spt roster::tests::detect_self_id_endpoint_id_leg_is_label_only_and_perch_gated
2026-08-17T23:40:41.5195163Z         PASS [   0.108s] ( 528/2562) spt::bin/spt roster::tests::detect_self_by_ancestry_resolves_a_live_ancestor_perch
2026-08-17T23:40:41.5295106Z         PASS [   0.101s] ( 529/2562) spt::bin/spt roster::tests::detect_self_id_resolves_identity_with_zero_git_spawns
2026-08-17T23:40:41.5433608Z         PASS [   0.096s] ( 530/2562) spt::bin/spt roster::tests::enumerate_yields_offline_corrupt_row_for_unparseable_info
2026-08-17T23:40:41.5505053Z         PASS [   0.064s] ( 531/2562) spt::bin/spt roster::tests::match_self_by_ancestry_disambiguates_and_none
2026-08-17T23:40:41.5525355Z         PASS [   0.118s] ( 532/2562) spt::bin/spt roster::tests::detect_self_resolves_spt_hosted_perch_via_parent_pid
2026-08-17T23:40:41.5640825Z         PASS [   0.044s] ( 533/2562) spt::bin/spt teardown::tests::an_unconfirmed_row_over_a_dead_root_is_stale_not_a_survivor
2026-08-17T23:40:41.5730735Z         PASS [   0.030s] ( 534/2562) spt::bin/spt teardown::tests::timeout_refuses_the_stamp_and_names_the_survivor
2026-08-17T23:40:41.5848560Z         PASS [   0.034s] ( 535/2562) spt::bin/spt teardown::tests::topology_gate_is_controllable_true_only
2026-08-17T23:40:41.5881081Z         PASS [   0.036s] ( 536/2562) spt::bin/spt tests::broken_pipe_panic_classifier
2026-08-17T23:40:41.5904172Z         PASS [   0.140s] ( 537/2562) spt::bin/spt roster::tests::list_all_perch_dirs_enumerates_nested_psyche_for_self_resolution
2026-08-17T23:40:41.5998912Z         PASS [   0.036s] ( 538/2562) spt::bin/spt tests::the_sized_stack_wrapper_maps_a_panic_to_the_main_thread_code
2026-08-17T23:40:41.6003901Z         PASS [   0.071s] ( 539/2562) spt::bin/spt teardown::tests::liveness_proof_needs_a_real_snapshot_and_finds_this_process
2026-08-17T23:40:41.6036030Z         PASS [   0.031s] ( 540/2562) spt::bin/spt trustwarnverb::tests::a_refusal_names_the_verb_the_endpoint_and_the_reason
2026-08-17T23:40:41.6069987Z         PASS [   0.022s] ( 541/2562) spt::bin/spt trustwarnverb::tests::showing_the_warning_is_never_elevation_gated
2026-08-17T23:40:41.6126058Z         PASS [   0.024s] ( 542/2562) spt::bin/spt trustwarnverb::tests::the_gate_keys_on_whether_the_verb_writes
2026-08-17T23:40:41.6250399Z         PASS [   0.035s] ( 543/2562) spt::bin/spt trustwarnverb::tests::writing_an_override_requires_confirmed_elevation
2026-08-17T23:40:41.6261704Z         PASS [   0.126s] ( 544/2562) spt::bin/spt roster::tests::parent_pid_candidates_stay_ancestry_gated
2026-08-17T23:40:41.6281243Z         PASS [   0.299s] ( 545/2562) spt::bin/spt api::startup::tests::bind_with_type_establishes_a_gateway_endpoint
2026-08-17T23:40:41.6367072Z         PASS [   1.875s] ( 546/2562) spt::bin/spt cli::tests::the_monic_command_path_treats_a_husk_as_present
2026-08-17T23:40:41.6441548Z         PASS [   0.206s] ( 547/2562) spt::bin/spt roster::tests::enumerate_nested_keeps_a_child_whose_name_has_no_kind_suffix
2026-08-17T23:40:41.6676171Z         PASS [   0.067s] ( 548/2562) spt::bin/spt unlisted::tests::a_cross_node_knock_says_answer_unknown_while_a_same_node_one_says_approved
2026-08-17T23:40:41.6742052Z         PASS [   0.074s] ( 549/2562) spt::bin/spt unlisted::tests::a_rule_only_row_has_no_node_to_route_to
2026-08-17T23:40:41.6793732Z         PASS [   0.076s] ( 550/2562) spt::bin/spt unlisted::tests::an_exclusion_and_an_unheard_of_id_are_different_refusals
2026-08-17T23:40:41.6876720Z         PASS [   0.081s] ( 551/2562) spt::bin/spt unlisted::tests::an_exclusion_outranks_the_strongest_evidence
2026-08-17T23:40:41.6930526Z         PASS [   0.080s] ( 552/2562) spt::bin/spt unlisted::tests::an_inbound_knock_is_never_read_as_our_own_outbound_act
2026-08-17T23:40:41.6969719Z         PASS [   0.072s] ( 553/2562) spt::bin/spt unlisted::tests::contact_evidence_outside_the_window_produces_no_row
2026-08-17T23:40:41.7014787Z         PASS [   0.075s] ( 554/2562) spt::bin/spt unlisted::tests::listed_local_and_excluded_rows_are_dropped_and_the_rest_survive
2026-08-17T23:40:41.7112326Z         PASS [   0.074s] ( 555/2562) spt::bin/spt unlisted::tests::no_evidence_phrase_claims_liveness
2026-08-17T23:40:41.7165361Z         PASS [   0.072s] ( 556/2562) spt::bin/spt unlisted::tests::no_knock_evidence_phrase_claims_liveness
2026-08-17T23:40:41.7212049Z         PASS [   0.054s] ( 557/2562) spt::bin/spt unlisted::tests::rule_evidence_carries_no_node_and_contact_evidence_does
2026-08-17T23:40:41.7279346Z         PASS [   0.053s] ( 558/2562) spt::bin/spt unlisted::tests::the_relative_stamp_is_coarse_and_has_no_zero_forms
2026-08-17T23:40:41.7347159Z         PASS [   0.055s] ( 559/2562) spt::bin/spt unlisted::tests::the_route_refuses_an_excluded_id_and_admits_a_non_excluded_one
2026-08-17T23:40:41.7355797Z         PASS [   0.107s] ( 560/2562) spt::bin/spt api::startup::tests::bind_with_unrelated_sid_is_unaffected_by_the_squat_guard
2026-08-17T23:40:41.7402934Z         PASS [   0.053s] ( 561/2562) spt::bin/spt unlisted::tests::the_strongest_provenance_labels_the_row_and_a_weaker_one_supplies_the_node
2026-08-17T23:40:41.7489688Z         PASS [   0.052s] ( 562/2562) spt-daemon access::tests::a_sender_endpoint_rule_does_not_admit_a_fork
2026-08-17T23:40:41.7547980Z         PASS [   0.062s] ( 563/2562) spt-daemon access::tests::a_fork_grant_admits_fork_and_nothing_else_admits_fork
2026-08-17T23:40:41.7676448Z         PASS [   0.066s] ( 564/2562) spt-daemon access::tests::corrupt_store_degrades_closed_but_replies_survive
2026-08-17T23:40:41.7742781Z         PASS [   0.058s] ( 565/2562) spt-daemon access::tests::discover_gate_withholds_everything_while_degraded
2026-08-17T23:40:41.7767236Z         PASS [   0.065s] ( 566/2562) spt-daemon access::tests::discover_gate_discloses_per_viewer
2026-08-17T23:40:41.7833374Z         PASS [   0.062s] ( 567/2562) spt-daemon access::tests::gate_decision_table
2026-08-17T23:40:41.8258299Z         PASS [   0.098s] ( 568/2562) spt-daemon access::tests::gate_feeds_the_proven_sender_endpoint_tier
2026-08-17T23:40:41.8325349Z         PASS [   0.097s] ( 569/2562) spt::bin/spt api::startup::tests::empty_session_seed_refusal_spends_the_seed_no_restore
2026-08-17T23:40:41.8326886Z         PASS [   0.098s] ( 570/2562) spt-daemon access::tests::gate_is_per_surface
2026-08-17T23:40:41.8409775Z         PASS [   0.086s] ( 571/2562) spt-daemon access::tests::the_decision_helpers_split_pass_from_refusal_for_every_reason
2026-08-17T23:40:41.8416524Z         PASS [   0.101s] ( 572/2562) spt-daemon access::tests::reply_passes_where_unsolicited_refused
2026-08-17T23:40:41.8540110Z         PASS [   0.077s] ( 573/2562) spt-daemon access::tests::the_inbound_lock_answers_replies_only_and_only_while_controlled
2026-08-17T23:40:41.8625736Z         PASS [   0.037s] ( 574/2562) spt-daemon access::tests::the_knock_exemption_hook_refuses_everything_today
2026-08-17T23:40:41.8729514Z         PASS [   0.124s] ( 575/2562) spt-daemon access::tests::same_node_always_passes_without_minting
2026-08-17T23:40:41.8761964Z         PASS [   0.044s] ( 576/2562) spt::bin/spt api::startup::tests::empty_session_seed_refused
2026-08-17T23:40:41.8763024Z         PASS [   0.102s] ( 577/2562) spt-daemon access::tests::the_engine_room_refuses_even_this_nodes_own_unsolicited_inbound
2026-08-17T23:40:41.8845382Z         PASS [   0.044s] ( 578/2562) spt-daemon access::tests::the_trust_warning_fires_only_for_an_entry_admitted_stranger
2026-08-17T23:40:41.8850786Z         PASS [   0.102s] ( 579/2562) spt-daemon access::tests::the_inbound_lock_is_reached_through_the_sender_stamped_entry_point
2026-08-17T23:40:41.8931734Z         PASS [   0.039s] ( 580/2562) spt-daemon activity::tests::a_state_change_owes_a_push_both_directions
2026-08-17T23:40:41.8991125Z         PASS [   0.036s] ( 581/2562) spt-daemon activity::tests::a_token_change_with_an_identical_state_owes_a_push
2026-08-17T23:40:41.9017846Z         PASS [   0.060s] ( 582/2562) spt-daemon access::tests::the_wire_origin_stamp_reaches_the_chain
2026-08-17T23:40:41.9035836Z         PASS [   0.031s] ( 583/2562) spt-daemon activity::tests::an_identical_observation_pushes_nothing
2026-08-17T23:40:41.9205258Z         PASS [   0.036s] ( 584/2562) spt-daemon activity::tests::an_unseen_link_owes_a_push
2026-08-17T23:40:41.9288095Z         PASS [   0.052s] ( 585/2562) spt-daemon activity::tests::an_owner_with_no_linked_shell_is_not_observed
2026-08-17T23:40:41.9305498Z         PASS [   0.037s] ( 586/2562) spt-daemon activity::tests::observe_links_on_an_absent_owlery_is_empty
2026-08-17T23:40:41.9429701Z         PASS [   0.110s] ( 587/2562) spt-daemon access::tests::the_pass_reason_names_which_arm_admitted_the_interaction
2026-08-17T23:40:41.9449825Z         PASS [   0.060s] ( 588/2562) spt-daemon activity::tests::an_unstamped_owner_observes_undated_and_stays_silent_across_sweeps
2026-08-17T23:40:41.9838443Z         PASS [   0.216s] ( 589/2562) spt-daemon access::tests::the_engine_room_is_disclosed_only_to_the_viewers_it_chose
2026-08-17T23:40:41.9865464Z         PASS [   0.085s] ( 590/2562) spt-daemon activity::tests::remember_forgets_a_vanished_link_so_its_return_re_pushes
2026-08-17T23:40:41.9932066Z         PASS [   0.089s] ( 591/2562) spt-daemon activity::tests::the_diff_is_per_link_not_per_owner
2026-08-17T23:40:41.9933197Z         PASS [   0.094s] ( 592/2562) spt-daemon activity::tests::observe_links_sees_only_online_shells_holding_a_token
2026-08-17T23:40:41.9968081Z         PASS [   0.076s] ( 593/2562) spt-daemon activity::tests::the_flip_marker_is_idempotent_to_drop_and_taken_exactly_once
2026-08-17T23:40:42.0005358Z         PASS [   0.072s] ( 594/2562) spt-daemon adapter_update::tests::delegated_attested_delegates_command
2026-08-17T23:40:42.0050117Z         PASS [   0.074s] ( 595/2562) spt-daemon adapter_update::tests::delegated_unattested_is_skipped
2026-08-17T23:40:42.0187514Z         PASS [   0.076s] ( 596/2562) spt-daemon adapter_update::tests::file_pull_tampered_bytes_rejected
2026-08-17T23:40:42.0195250Z         PASS [   0.036s] ( 597/2562) spt-daemon adapter_update::tests::file_pull_without_payload_is_skipped
2026-08-17T23:40:42.0236850Z         PASS [   0.079s] ( 598/2562) spt-daemon adapter_update::tests::file_pull_verified_against_adapter_key
2026-08-17T23:40:42.0286936Z         PASS [   0.036s] ( 599/2562) spt-daemon adapter_update::tests::gh_release_is_managed_cli_side_not_in_pure_plan
2026-08-17T23:40:42.0322727Z         PASS [   0.046s] ( 600/2562) spt-daemon adapter_update::tests::file_pull_wrong_key_rejected
2026-08-17T23:40:42.0422676Z         PASS [   0.049s] ( 601/2562) spt-daemon adapter_update::tests::ripple_conducts_each_adapter_in_order
2026-08-17T23:40:42.0658210Z         PASS [   0.042s] ( 602/2562) spt-daemon attach::tests::the_engine_room_has_no_viewport_and_takes_its_controls_from_home
2026-08-17T23:40:42.0766974Z         PASS [   0.057s] ( 603/2562) spt-daemon answerop::tests::an_unknown_outcome_token_acts_on_nothing
2026-08-17T23:40:42.0797477Z         PASS [   0.038s] ( 604/2562) spt-daemon autostart::tests::empty_config_is_a_pure_noop
2026-08-17T23:40:42.0809812Z         PASS [   0.052s] ( 605/2562) spt-daemon attach::tests::viewer_and_driving_intents_gate_on_different_surfaces
2026-08-17T23:40:42.0818416Z         PASS [   0.085s] ( 606/2562) spt-daemon adapter_update::tests::ripple_registered_uses_the_registered_set
2026-08-17T23:40:42.1058553Z         PASS [   0.040s] ( 607/2562) spt-daemon autostart::tests::unresolved_adapter_loud_skips_before_any_launch
2026-08-17T23:40:42.1112875Z         PASS [   0.035s] ( 608/2562) spt-daemon brain::tests::a_flagged_sync_frame_baselines_forward_never_backward_on_both_paths
2026-08-17T23:40:42.1140821Z         PASS [   0.034s] ( 609/2562) spt-daemon brain::tests::an_old_broker_wire_without_the_sync_key_keeps_every_legacy_path
2026-08-17T23:40:42.1171035Z         PASS [   0.241s] ( 610/2562) spt::bin/spt api::startup::tests::establish_stamps_controllable_by_hosting_mode
2026-08-17T23:40:42.1219331Z         PASS [   0.041s] ( 611/2562) spt-daemon brain::tests::cold_brain_still_rejects_a_forward_output_gap
2026-08-17T23:40:42.1270778Z         PASS [   0.045s] ( 612/2562) spt-daemon brain::tests::controller_resume_from_floor_refetches_after_a_gap
2026-08-17T23:40:42.1310678Z         PASS [   0.025s] ( 613/2562) spt-daemon brain::tests::peer_reply_deadline_caps_below_carrier_deadline
2026-08-17T23:40:42.1352512Z         PASS [   0.024s] ( 614/2562) spt-daemon brain::tests::reclassify_peer_reply_maps_timeout_off_poison
2026-08-17T23:40:42.1536621Z         PASS [   0.153s] ( 615/2562) spt-daemon answerop::tests::a_denial_disarms_but_only_when_it_is_proven
2026-08-17T23:40:42.1911379Z         PASS [   0.077s] ( 616/2562) spt-daemon brain::tests::skip_to_live_accepts_a_forward_seq_jump_via_snap_above
2026-08-17T23:40:42.1948336Z         PASS [   0.078s] ( 617/2562) spt::bin/spt api::startup::tests::fresh_bind_over_dead_life_needs_both_terminal_and_a_new_session
2026-08-17T23:40:42.1957635Z         PASS [   0.177s] ( 618/2562) spt-daemon answerop::tests::a_receipt_from_the_wrong_answerer_or_a_replayed_one_acts_on_nothing
2026-08-17T23:40:42.2151629Z         PASS [   0.210s] ( 619/2562) spt-daemon answerop::tests::a_receipt_fires_only_from_the_node_the_knock_was_sent_to
2026-08-17T23:40:42.2157245Z         PASS [   0.088s] ( 620/2562) spt-daemon brainproc::tests::appended_padding_flips_exe_hash
2026-08-17T23:40:42.2181897Z         PASS [   0.096s] ( 621/2562) spt-daemon brain::tests::viewer_snap_attach_accepts_a_forward_output_gap
2026-08-17T23:40:42.2198502Z         PASS [   0.089s] ( 622/2562) spt-daemon brainproc::tests::backoff_doubles_on_fast_death_resets_when_healthy
2026-08-17T23:40:42.2225023Z         PASS [   0.087s] ( 623/2562) spt-daemon brainproc::tests::brain_child_args_carry_generation_and_reason
2026-08-17T23:40:42.2257448Z         PASS [   0.072s] ( 624/2562) spt-daemon brainproc::tests::bytes_gate_truth_table
2026-08-17T23:40:42.2409397Z         PASS [   0.045s] ( 625/2562) spt-daemon brainproc::tests::consumer_gate_spawns_once_when_net_enabled
2026-08-17T23:40:42.2730335Z         PASS [   0.057s] ( 626/2562) spt-daemon brainproc::tests::planned_restart_respawns_with_update_reason
2026-08-17T23:40:42.2920109Z         PASS [   0.066s] ( 627/2562) spt-daemon brainproc::tests::ready_exe_hash_parses_and_is_n1_readable
2026-08-17T23:40:42.2968224Z         PASS [   6.205s] ( 628/2562) spt::bin/spt cli::tests::adapter_translate_proof_gates_on_commit
2026-08-17T23:40:42.3393607Z         PASS [   0.119s] ( 629/2562) spt-daemon brainproc::tests::ready_but_wrong_bytes_rolls_back_never_promotes
2026-08-17T23:40:42.3433609Z         PASS [   0.071s] ( 630/2562) spt-daemon brainproc::tests::ready_generation_parses_stamp_and_fails_safe
2026-08-17T23:40:42.3466102Z         PASS [   0.105s] ( 631/2562) spt-daemon brainproc::tests::ready_generation_at_reads_file_and_absent_is_none
2026-08-17T23:40:42.3522149Z         PASS [   0.056s] ( 632/2562) spt-daemon brainproc::tests::rollback_running_version_is_prior_not_n_minus_one
2026-08-17T23:40:42.3621426Z         PASS [   0.019s] ( 633/2562) spt-daemon brainproc::tests::select_brain_exe_prefers_canonical_over_per_spawn_current_exe
2026-08-17T23:40:42.3677044Z         PASS [   0.028s] ( 634/2562) spt-daemon brainproc::tests::rolled_back_record_spawns_rollback_binary_on_a_fresh_supervisor
2026-08-17T23:40:42.3740374Z         PASS [   0.022s] ( 635/2562) spt-daemon brainproc::tests::start_reason_arg_round_trips_and_is_lenient
2026-08-17T23:40:42.3805162Z         PASS [   0.186s] ( 636/2562) spt::bin/spt api::startup::tests::fresh_create_over_a_stopped_life_reads_active_with_no_wake
2026-08-17T23:40:42.4449302Z         PASS [   3.943s] ( 637/2562) spt::bin/spt cli::tests::purge_removes_every_record
2026-08-17T23:40:42.5053644Z         PASS [   0.125s] ( 638/2562) spt::bin/spt api::startup::tests::fresh_create_with_no_prior_carries_no_rest_state
2026-08-17T23:40:42.5191694Z         PASS [   0.014s] ( 639/2562) spt::bin/spt api::startup::tests::listen_never_asserts_hosting_topology_and_bind_still_does
2026-08-17T23:40:42.5300177Z         PASS [   0.011s] ( 640/2562) spt::bin/spt api::startup::tests::listen_online_gate_refuses_capability_only_online
2026-08-17T23:40:42.5422735Z         PASS [   0.012s] ( 641/2562) spt::bin/spt api::startup::tests::listen_orphan_exit_line_names_self_and_parent
2026-08-17T23:40:42.5457190Z         PASS [   0.323s] ( 642/2562) spt-daemon brainproc::tests::ready_candidate_promotes_once_old_gen_drains
2026-08-17T23:40:42.5543076Z         PASS [   4.867s] ( 643/2562) spt::bin/spt cli::tests::fork_forks_homes_and_deletes_exactly_the_source
2026-08-17T23:40:42.5900870Z         PASS [   0.299s] ( 644/2562) spt-daemon brainproc::tests::ready_with_matching_bytes_promotes
2026-08-17T23:40:42.6113769Z         PASS [   0.056s] ( 645/2562) spt-daemon codec::tests::back_to_back_frames_decode_independently
2026-08-17T23:40:42.6232336Z         PASS [   0.033s] ( 646/2562) spt-daemon codec::tests::frame_round_trips_through_buffer
2026-08-17T23:40:42.6346205Z         PASS [   0.024s] ( 647/2562) spt-daemon codec::tests::oversized_prefix_rejected
2026-08-17T23:40:42.6395358Z         PASS [   0.097s] ( 648/2562) spt::bin/spt api::startup::tests::live_perch_under_other_session_conflicts
2026-08-17T23:40:42.6483616Z         PASS [   0.025s] ( 649/2562) spt-daemon config::tests::auto_suspend_knob_is_opt_in_default_off
2026-08-17T23:40:42.6561906Z         PASS [   0.021s] ( 650/2562) spt-daemon config::tests::crash_grace_is_config_driven
2026-08-17T23:40:42.6616929Z         PASS [   0.022s] ( 651/2562) spt::bin/spt api::startup::tests::missing_seed_refused
2026-08-17T23:40:42.6709455Z         PASS [   0.022s] ( 652/2562) spt-daemon config::tests::detached_subnets_knob_defaults_empty
2026-08-17T23:40:42.6729762Z         LEAK [   0.482s] ( 653/2562) spt-daemon brainproc::tests::clear_before_spawn_defeats_exact_generation_stale_file
2026-08-17T23:40:42.6777888Z         PASS [   0.022s] ( 654/2562) spt-daemon config::tests::full_auto_update_is_gated_by_default
2026-08-17T23:40:42.6922978Z         PASS [   0.019s] ( 655/2562) spt-daemon config::tests::missing_file_is_default
2026-08-17T23:40:42.6935427Z         PASS [   0.022s] ( 656/2562) spt-daemon config::tests::malformed_file_degrades_to_default
2026-08-17T23:40:42.6991968Z         PASS [   0.037s] ( 657/2562) spt::bin/spt api::startup::tests::no_seed_is_the_fallback_trigger_then_sid_binds
2026-08-17T23:40:42.6994095Z         PASS [   0.255s] ( 658/2562) spt-daemon brainproc::tests::trial_promotes_on_ready_then_supervises_the_accepted_binary
2026-08-17T23:40:42.6995478Z         LEAK [   0.481s] ( 659/2562) spt-daemon brainproc::tests::ready_but_old_gen_never_drains_does_not_promote_rolls_back
2026-08-17T23:40:42.7079359Z         PASS [   0.030s] ( 660/2562) spt-daemon config::tests::pulse_period_is_config_driven
2026-08-17T23:40:42.7281231Z         PASS [   0.036s] ( 661/2562) spt-daemon config::tests::relay_choice_is_config_driven
2026-08-17T23:40:42.7430080Z         PASS [   0.050s] ( 662/2562) spt-daemon config::tests::remove_startup_endpoint_takes_one_entry_and_reports_whether_there_was_one
2026-08-17T23:40:42.7632923Z         PASS [   0.064s] ( 663/2562) spt::bin/spt api::startup::tests::only_an_unverified_refusal_names_its_escape
2026-08-17T23:40:42.7853829Z         PASS [   0.086s] ( 664/2562) spt-daemon config::tests::save_load_roundtrip
2026-08-17T23:40:42.7956314Z         PASS [   0.067s] ( 665/2562) spt-daemon conn::tests::conn_ids_are_unique_and_labels_stay_bounded
2026-08-17T23:40:42.7962988Z         PASS [   0.097s] ( 666/2562) spt-daemon config::tests::startup_endpoints_roundtrip
2026-08-17T23:40:42.7973728Z         PASS [   0.054s] ( 667/2562) spt-daemon conn::tests::organic_write_failure_still_poisons_and_is_not_the_timeout_class
2026-08-17T23:40:42.8002300Z         PASS [   0.037s] ( 668/2562) spt::bin/spt api::startup::tests::only_gone_changes_the_conflict_verdict
2026-08-17T23:40:42.8052695Z         PASS [   0.020s] ( 669/2562) spt-daemon conn::tests::retirement_token_splits_deadline_from_organic_with_attribution_parity
2026-08-17T23:40:42.8098256Z         PASS [   0.014s] ( 670/2562) spt-daemon consent::tests::decide_honors_full_auto_flag
2026-08-17T23:40:42.8258649Z         PASS [   0.118s] ( 671/2562) spt-daemon config::tests::upsert_startup_endpoint_appends_then_replaces_preserving_other_knobs
2026-08-17T23:40:42.8542647Z         PASS [   0.049s] ( 672/2562) spt-daemon crc_swap::tests::apply_rollback_never_strands
2026-08-17T23:40:42.8671013Z         PASS [   0.071s] ( 673/2562) spt-daemon consent::tests::no_live_session_resolves_to_none
2026-08-17T23:40:42.8672373Z         PASS [   0.057s] ( 674/2562) spt-daemon crc_swap::tests::apply_swaps_changed_creates_new_untouched_identical
2026-08-17T23:40:42.8763270Z         PASS [   0.514s] ( 675/2562) spt-daemon brainproc::tests::supervisor_owns_generation_and_stamps_start_reason
2026-08-17T23:40:42.8770695Z         PASS [   0.509s] ( 676/2562) spt-daemon brainproc::tests::supervisor_respawns_brain_until_stopped
2026-08-17T23:40:42.9045969Z         PASS [   0.078s] ( 677/2562) spt-daemon crc_swap::tests::crash_recovery_missing_target_keeps_last_good_old
2026-08-17T23:40:42.9095025Z         PASS [   0.055s] ( 678/2562) spt-daemon crc_swap::tests::displace_picks_fresh_old_name_and_gc_sweeps_stale
2026-08-17T23:40:42.9259943Z         PASS [   0.125s] ( 679/2562) spt::bin/spt api::startup::tests::parent_watchdog_triggers_exit_on_a_dead_parent_only
2026-08-17T23:40:42.9435459Z         PASS [   0.067s] ( 680/2562) spt-daemon crc_swap::tests::plan_selects_only_changed
2026-08-17T23:40:42.9436048Z         PASS [   0.076s] ( 681/2562) spt-daemon crc_swap::tests::plan_recurses_nested_dirs
2026-08-17T23:40:42.9438711Z         PASS [   0.067s] ( 682/2562) spt-daemon crc_swap::tests::swap_error_carries_op_and_paths
2026-08-17T23:40:42.9503410Z         PASS [   0.153s] ( 683/2562) spt-daemon consent::tests::resolves_most_recently_active_live_session
2026-08-17T23:40:42.9570051Z         PASS [   0.053s] ( 684/2562) spt-daemon daemon::tests::a_captured_spawn_inherits_only_the_handle_in_its_allowlist
2026-08-17T23:40:42.9880210Z         PASS [   0.044s] ( 685/2562) spt-daemon daemon::tests::an_ordinary_teardown_announces_nothing
2026-08-17T23:40:42.9955581Z         LEAK [   0.622s] ( 686/2562) spt-daemon brainproc::tests::trial_kills_alive_never_ready_candidate_before_rollback
2026-08-17T23:40:42.9965910Z         PASS [   0.087s] ( 687/2562) spt-daemon daemon::tests::a_failed_job_termination_announces_the_tree_loss
2026-08-17T23:40:43.0107911Z         LEAK [   0.665s] ( 688/2562) spt-daemon brainproc::tests::stale_generation_minus_one_ready_never_promotes
2026-08-17T23:40:43.0410293Z         PASS [   0.097s] ( 689/2562) spt-daemon daemon::tests::a_scrubbed_variable_never_reaches_the_child
2026-08-17T23:40:43.0414407Z         PASS [   0.053s] ( 690/2562) spt-daemon daemon::tests::drive_ladder_all_err_returns_last_err
2026-08-17T23:40:43.0448090Z         PASS [   0.119s] ( 691/2562) spt::bin/spt api::startup::tests::post_spawn_bind_establishes_perch
2026-08-17T23:40:43.0639937Z         PASS [   0.068s] ( 692/2562) spt-daemon daemon::tests::drive_ladder_falls_through_to_next_rung_on_err
2026-08-17T23:40:43.0733768Z         PASS [   0.075s] ( 693/2562) spt-daemon daemon::tests::drive_ladder_picks_first_ok_rung
2026-08-17T23:40:43.0849730Z         PASS [   0.074s] ( 694/2562) spt-daemon daemon::tests::ensure_declines_only_against_a_standing_operator_stop
2026-08-17T23:40:43.0915214Z         PASS [   0.027s] ( 695/2562) spt-daemon daemon::tests::launch_ladder_order_is_wmi_schtasks_breakaway_injob
2026-08-17T23:40:43.0954522Z         PASS [   0.054s] ( 696/2562) spt-daemon daemon::tests::is_running_tracks_the_seed_channel
2026-08-17T23:40:43.0991104Z         PASS [   0.059s] ( 697/2562) spt-daemon daemon::tests::implicit_ensure_declines_without_clearing_the_inhibit
2026-08-17T23:40:43.1164553Z         PASS [   0.249s] ( 698/2562) spt-daemon crc_swap::tests::mapped_old_does_not_brick_apply_displaces_aside
2026-08-17T23:40:43.1246329Z         PASS [   0.080s] ( 699/2562) spt::bin/spt api::startup::tests::prebind_refusal_restores_the_seed_for_retry
2026-08-17T23:40:43.1362373Z         PASS [   0.064s] ( 700/2562) spt-daemon daemon::tests::net_retry_backoff_doubles_then_caps
2026-08-17T23:40:43.1422332Z         PASS [   0.057s] ( 701/2562) spt-daemon daemon::tests::null_std_handles_only_on_a_pipe_stderr
2026-08-17T23:40:43.1441462Z         PASS [   0.201s] ( 702/2562) spt-daemon daemon::tests::a_tree_teardown_reaches_a_grandchild_the_service_spawned
2026-08-17T23:40:43.1543563Z         PASS [   0.059s] ( 703/2562) spt-daemon daemon::tests::the_refusal_line_names_the_remedy
2026-08-17T23:40:43.1612004Z         PASS [   0.062s] ( 704/2562) spt-daemon daemon::tests::the_tree_loss_line_names_the_loss_not_the_syscall
2026-08-17T23:40:43.1644602Z         PASS [   0.048s] ( 705/2562) spt-daemon daemon::tests::windows_arg_quoting_roundtrips_the_rules
2026-08-17T23:40:43.1728869Z         PASS [   0.048s] ( 706/2562) spt::bin/spt api::startup::tests::read_env_measured_capture_replaces_prior_stamp
2026-08-17T23:40:43.1848441Z         PASS [   0.042s] ( 707/2562) spt-daemon deadline::tests::advance_after_fire_steps_one_grid_normally_and_collapses_a_stall
2026-08-17T23:40:43.1850772Z         PASS [   0.049s] ( 708/2562) spt-daemon daemon::tests::wmi_create_script_carries_the_no_window_startup_spec
2026-08-17T23:40:43.1913591Z         PASS [   0.100s] ( 709/2562) spt-daemon daemon::tests::spawn_env_additions_reach_the_child_and_keep_the_inherited_environment
2026-08-17T23:40:43.1977269Z         PASS [   0.054s] ( 710/2562) spt-daemon deadline::tests::cold_and_crash_write_fresh_anchor_at_now
2026-08-17T23:40:43.2302045Z         PASS [   0.273s] ( 711/2562) spt-daemon daemon::tests::detached_no_inherit_falls_back_under_a_breakaway_denying_job
2026-08-17T23:40:43.2495004Z         PASS [   0.088s] ( 712/2562) spt-daemon deadline::tests::distinct_keys_do_not_cross_clobber
2026-08-17T23:40:43.2499808Z         PASS [   0.096s] ( 713/2562) spt-daemon deadline::tests::corrupt_file_degrades_to_fresh
2026-08-17T23:40:43.2509676Z         PASS [   0.087s] ( 714/2562) spt-daemon deadline::tests::next_fire_between_grid_points_rounds_up
2026-08-17T23:40:43.2650689Z         PASS [   0.080s] ( 715/2562) spt-daemon deadline::tests::next_fire_long_jump_collapses_missed_ticks_to_one
2026-08-17T23:40:43.2666733Z         PASS [   0.721s] ( 716/2562) spt-daemon brainproc::tests::trial_rolls_back_after_budget_of_pre_ready_exits
2026-08-17T23:40:43.2752640Z         PASS [   0.090s] ( 717/2562) spt-daemon deadline::tests::next_fire_on_grid_returns_now_and_advances_strictly
2026-08-17T23:40:43.2788278Z         PASS [   0.087s] ( 718/2562) spt-daemon deadline::tests::next_fire_saturates_when_now_precedes_anchor
2026-08-17T23:40:43.2814322Z         PASS [   0.331s] ( 719/2562) spt-daemon daemon::tests::breakaway_spawn_escapes_a_kill_on_close_job
2026-08-17T23:40:43.2823548Z         PASS [   0.085s] ( 720/2562) spt-daemon deadline::tests::one_shot_fires_at_or_after_target_and_never_resets
2026-08-17T23:40:43.2885653Z         PASS [   0.058s] ( 721/2562) spt-daemon deadline::tests::update_keeps_anchor_and_refreshes_interval
2026-08-17T23:40:43.2912587Z         PASS [   0.042s] ( 722/2562) spt-daemon deadline::tests::update_with_no_file_falls_back_fresh
2026-08-17T23:40:43.2957102Z         PASS [   0.046s] ( 723/2562) spt-daemon deadline::tests::zero_interval_degrades_to_config_default
2026-08-17T23:40:43.3006615Z         PASS [   0.050s] ( 724/2562) spt-daemon deelevate::tests::env_overlay_keeps_explicit_spt_home_alive
2026-08-17T23:40:43.3056025Z         PASS [   0.041s] ( 725/2562) spt-daemon deelevate::tests::plan_spawn_deelevates_only_with_a_target
2026-08-17T23:40:43.3089932Z         PASS [   0.042s] ( 726/2562) spt-daemon digest::tests::common_prefix_len_finds_the_unchanged_head
2026-08-17T23:40:43.3818782Z         PASS [   0.098s] ( 727/2562) spt-daemon digest::tests::merge_by_ts_interleaves_context
2026-08-17T23:40:43.3940065Z         PASS [   0.221s] ( 728/2562) spt::bin/spt api::startup::tests::rebind_same_session_ok
2026-08-17T23:40:43.3954441Z         PASS [   0.107s] ( 729/2562) spt-daemon digest::tests::projects_empty_for_a_sourceless_endpoint
2026-08-17T23:40:43.3958501Z         PASS [   0.104s] ( 730/2562) spt-daemon digest::tests::resolve_config_precedence
2026-08-17T23:40:43.4045926Z         PASS [   0.125s] ( 731/2562) spt-daemon digest::tests::log_less_two_origin_merge_interleaves_by_ts
2026-08-17T23:40:43.4071039Z         PASS [   0.111s] ( 732/2562) spt-daemon digest::tests::supersede_collapses_cross_generation_replay_to_newest
2026-08-17T23:40:43.4083147Z         PASS [   0.108s] ( 733/2562) spt-daemon digest::tests::supersede_is_noop_on_disjoint_sessions
2026-08-17T23:40:43.4151550Z         PASS [   0.109s] ( 734/2562) spt-daemon digest::tests::supersede_keeps_within_generation_repeats
2026-08-17T23:40:43.4162617Z         PASS [   0.134s] ( 735/2562) spt-daemon digest::tests::projects_a_log_less_endpoint_from_digest_log
2026-08-17T23:40:43.4199649Z         PASS [   0.111s] ( 736/2562) spt-daemon digest::tests::supersede_trims_divider_around_emptied_middle_generation
2026-08-17T23:40:43.4210335Z         PASS [   0.042s] ( 737/2562) spt-daemon digesthub::tests::dropped_subscriber_is_pruned
2026-08-17T23:40:43.4276784Z         PASS [   9.073s] ( 738/2562) spt::bin/spt cli::tests::a_remote_fork_refuses_delete_source_whole_rather_than_trimming_it
2026-08-17T23:40:43.4475087Z         PASS [   0.052s] ( 739/2562) spt-daemon digesthub::tests::project_and_publish_stores_latest
2026-08-17T23:40:43.4524169Z         PASS [   0.057s] ( 740/2562) spt-daemon digesthub::tests::publish_delta_is_tail_then_full_refresh
2026-08-17T23:40:43.4590223Z         PASS [   0.054s] ( 741/2562) spt-daemon digesthub::tests::render_is_glanceable
2026-08-17T23:40:43.4654814Z         PASS [   0.059s] ( 742/2562) spt-daemon digesthub::tests::subscribe_returns_current_base
2026-08-17T23:40:43.4685407Z         PASS [   0.060s] ( 743/2562) spt-daemon dispatch::tests::a_fork_record_is_never_read_as_a_message_and_an_old_daemon_drops_it
2026-08-17T23:40:43.5190875Z         PASS [   0.104s] ( 744/2562) spt-daemon dispatch::tests::a_knock_record_routes_here_and_drops_cleanly_on_an_n1_daemon
2026-08-17T23:40:43.5285754Z         PASS [   0.112s] ( 745/2562) spt-daemon dispatch::tests::a_presence_record_classifies_as_its_own_family_and_never_as_a_message
2026-08-17T23:40:43.5355881Z         PASS [   0.116s] ( 746/2562) spt-daemon dispatch::tests::a_receipt_is_never_read_as_a_message_and_never_as_a_knock
2026-08-17T23:40:43.5388044Z         PASS [   0.263s] ( 747/2562) spt-daemon digest::tests::extractor_spans_sessions_with_a_boundary_marker
2026-08-17T23:40:43.5407982Z         PASS [   0.120s] ( 748/2562) spt-daemon dispatch::tests::a_redemption_is_dropped_by_an_old_daemon_where_a_knock_field_would_have_been_accepted
2026-08-17T23:40:43.5521718Z         PASS [   0.100s] ( 749/2562) spt-daemon dispatch::tests::breaker_trips_with_doubling_capped_window_and_resets_on_progress
2026-08-17T23:40:43.5579965Z         PASS [   0.099s] ( 750/2562) spt-daemon dispatch::tests::classifies_every_family_by_first_line_shape
2026-08-17T23:40:43.5617195Z         PASS [   0.096s] ( 751/2562) spt-daemon dispatch::tests::classify_failure_seat_blocked_is_exactly_the_three_discipline_strings
2026-08-17T23:40:43.5663102Z         PASS [   0.098s] ( 752/2562) spt-daemon dispatch::tests::cold_enumeration_claims_at_most_the_pool_bound_per_poll
2026-08-17T23:40:43.5702691Z         PASS [   0.051s] ( 753/2562) spt-daemon dispatch::tests::digest_pull_and_rest_never_read_as_each_other
2026-08-17T23:40:43.5741956Z         PASS [   0.046s] ( 754/2562) spt-daemon dispatch::tests::dispatch_event_carries_the_complete_key_set
2026-08-17T23:40:43.5794501Z         PASS [   0.044s] ( 755/2562) spt-daemon dispatch::tests::each_presence_word_has_exactly_one_authority
2026-08-17T23:40:43.5846395Z         PASS [   0.046s] ( 756/2562) spt-daemon dispatch::tests::feed_accumulator_commits_per_bound_never_per_chunk
2026-08-17T23:40:43.5875984Z         PASS [   0.194s] ( 757/2562) spt::bin/spt api::startup::tests::revive_preserves_prior_rest_state_and_dormant_anchor
2026-08-17T23:40:43.5899728Z         PASS [   0.049s] ( 758/2562) spt-daemon dispatch::tests::finished_is_terminal_for_attach_only
2026-08-17T23:40:43.5947558Z         PASS [   0.043s] ( 759/2562) spt-daemon dispatch::tests::line_endpoint_resolves_each_family_identity_key
2026-08-17T23:40:43.5992554Z         PASS [   0.041s] ( 760/2562) spt-daemon dispatch::tests::oneway_seatblocked_strikes_out_terminal_while_request_reply_paces_forever
2026-08-17T23:40:43.6035328Z         PASS [   0.042s] ( 761/2562) spt-daemon dispatch::tests::only_the_old_broker_unknown_verb_answer_falls_back_to_the_peek
2026-08-17T23:40:43.6071116Z         PASS [   0.041s] ( 762/2562) spt-daemon dispatch::tests::seat_blocked_requeues_budget_free_paced_by_the_breaker_window
2026-08-17T23:40:43.6079790Z         PASS [   1.576s] ( 763/2562) spt-daemon autostart::tests::a_persisted_reserved_id_default_is_never_replayed
2026-08-17T23:40:43.6124909Z         PASS [   0.042s] ( 764/2562) spt-daemon dispatch::tests::the_family_census_is_bijective_with_the_enum
2026-08-17T23:40:43.6167683Z         PASS [   0.043s] ( 765/2562) spt-daemon dispatch::tests::the_family_census_knows_about_the_answer_receipt
2026-08-17T23:40:43.6231529Z         PASS [   0.176s] ( 766/2562) spt-daemon dispatch::tests::an_unadmitted_asker_is_refused_at_this_nodes_own_seam
2026-08-17T23:40:43.6332753Z         PASS [   0.043s] ( 767/2562) spt-daemon dispatch::tests::transient_failure_requeues_bounded_and_terminal_never_reenters
2026-08-17T23:40:43.6382476Z         PASS [   0.043s] ( 768/2562) spt-daemon dispatch::tests::unknown_shapes_refuse_classification
2026-08-17T23:40:43.6420137Z         PASS [   0.043s] ( 769/2562) spt-daemon docshost::tests::content_types_cover_the_bundle_classes
2026-08-17T23:40:43.6915526Z         PASS [   0.088s] ( 770/2562) spt-daemon docshost::tests::port_resolution_env_config_default
2026-08-17T23:40:43.6973170Z         PASS [   0.090s] ( 771/2562) spt-daemon docshost::tests::sanitizer_admits_pages_and_rejects_escapes
2026-08-17T23:40:43.7024008Z         PASS [   0.094s] ( 772/2562) spt-daemon drivehub::tests::a_following_op_is_served_when_nothing_refused
2026-08-17T23:40:43.7035954Z         PASS [   0.124s] ( 773/2562) spt-daemon dispatch::tests::the_receiver_decides_origin_and_flood_not_the_sender
2026-08-17T23:40:43.7078124Z         PASS [   0.095s] ( 774/2562) spt-daemon drivehub::tests::a_foreign_owlery_is_refused_pre_ack_under_its_own_name
2026-08-17T23:40:43.7119127Z         PASS [   0.095s] ( 775/2562) spt-daemon drivehub::tests::activity_and_drive_never_clobber_each_other
2026-08-17T23:40:43.7166752Z         PASS [   0.093s] ( 776/2562) spt-daemon drivehub::tests::activity_take_is_latest_wins_and_exactly_once
2026-08-17T23:40:43.7206245Z         PASS [   0.087s] ( 777/2562) spt-daemon drivehub::tests::an_unknown_op_hangs_up_instead_of_being_swallowed
2026-08-17T23:40:43.7249112Z         PASS [   0.087s] ( 778/2562) spt-daemon drivehub::tests::clear_evicts_both_classes
2026-08-17T23:40:43.7290202Z         PASS [   0.087s] ( 779/2562) spt-daemon drivehub::tests::clear_evicts_the_slot
2026-08-17T23:40:43.7328209Z         PASS [   0.041s] ( 780/2562) spt-daemon drivehub::tests::dead_generation_activity_frame_is_never_served
2026-08-17T23:40:43.7373059Z         PASS [   0.040s] ( 781/2562) spt-daemon drivehub::tests::dead_generation_frame_is_never_served
2026-08-17T23:40:43.7416168Z         PASS [   0.039s] ( 782/2562) spt-daemon drivehub::tests::drive_result_activity_key_is_additive_on_the_wire
2026-08-17T23:40:43.7451757Z         PASS [   0.042s] ( 783/2562) spt-daemon drivehub::tests::only_a_pre_ack_refusal_permits_a_second_spawn
2026-08-17T23:40:43.7507938Z         PASS [   0.043s] ( 784/2562) spt-daemon drivehub::tests::slots_are_per_owner
2026-08-17T23:40:43.7535346Z         PASS [   0.042s] ( 785/2562) spt-daemon drivehub::tests::take_is_exactly_once
2026-08-17T23:40:43.7573657Z         PASS [   0.041s] ( 786/2562) spt-daemon drivehub::tests::the_launch_reply_shapes_round_trip
2026-08-17T23:40:43.7648934Z         PASS [   0.040s] ( 787/2562) spt-daemon drivehub::tests::write_is_latest_wins
2026-08-17T23:40:43.7766440Z         PASS [   0.044s] ( 788/2562) spt-daemon effect::tests::apply_once_does_not_hold_the_journal_lock_across_effect
2026-08-17T23:40:43.7900540Z         PASS [   0.039s] ( 789/2562) spt-daemon effect::tests::marker_is_single_source_and_frozen
2026-08-17T23:40:43.7936530Z         PASS [   0.040s] ( 790/2562) spt-daemon effect::tests::minter_tag_round_trips
2026-08-17T23:40:43.8007594Z         PASS [   0.043s] ( 791/2562) spt-daemon effect::tests::open_creates_missing_parent_dirs
2026-08-17T23:40:43.8476574Z         PASS [   0.106s] ( 792/2562) spt-daemon effect::tests::failed_effect_is_not_recorded_applied
2026-08-17T23:40:43.8477438Z         PASS [   0.118s] ( 793/2562) spt-daemon effect::tests::applied_set_survives_reopen
2026-08-17T23:40:43.8478031Z         PASS [   0.083s] ( 794/2562) spt-daemon effect::tests::poisoned_journal_lock_still_applies_subsequent_ops
2026-08-17T23:40:43.8532181Z         PASS [   0.425s] ( 795/2562) spt-daemon dispatch::tests::a_served_probe_leaves_the_targets_spool_and_inbox_byte_identical
2026-08-17T23:40:43.8608691Z         PASS [   0.084s] ( 796/2562) spt-daemon effect::tests::ptywrite_skips_the_durable_journal_write_while_netsend_persists
2026-08-17T23:40:43.8729567Z         PASS [   0.079s] ( 797/2562) spt-daemon effect::tests::second_apply_for_same_key_is_deduped
2026-08-17T23:40:43.8760098Z         PASS [   0.288s] ( 798/2562) spt::bin/spt api::startup::tests::revive_without_cwd_preserves_prior_cwd
2026-08-17T23:40:43.8815971Z         PASS [   0.034s] ( 799/2562) spt-daemon effect::tests::with_tracing_retry_no_retry_on_success
2026-08-17T23:40:43.8863416Z         PASS [   0.039s] ( 800/2562) spt-daemon effect::tests::with_tracing_retry_passes_through_other_errors
2026-08-17T23:40:43.8941997Z         PASS [   0.046s] ( 801/2562) spt-daemon effect::tests::with_tracing_retry_retries_once_on_no_longer_held
2026-08-17T23:40:43.8944906Z         PASS [   0.104s] ( 802/2562) spt-daemon effect::tests::recover_is_migration_free
2026-08-17T23:40:43.9012273Z         PASS [   0.048s] ( 803/2562) spt-daemon effect::tests::with_tracing_retry_terminal_is_public_language
2026-08-17T23:40:43.9046358Z         PASS [   0.044s] ( 804/2562) spt-daemon failedaddr::tests::a_null_address_records_nothing
2026-08-17T23:40:43.9092869Z         PASS [   0.036s] ( 805/2562) spt-daemon failedaddr::tests::a_successful_dial_clears_the_record
2026-08-17T23:40:43.9186164Z         PASS [   0.118s] ( 806/2562) spt-daemon effect::tests::shellchan_and_rc_same_session_dont_collide
2026-08-17T23:40:43.9248939Z         PASS [   0.043s] ( 807/2562) spt-daemon failedaddr::tests::an_expired_record_stops_matching_and_is_swept
2026-08-17T23:40:43.9293720Z         PASS [   0.043s] ( 808/2562) spt-daemon failedaddr::tests::connecting_to_a_peer_clears_only_that_peers_records
2026-08-17T23:40:43.9333289Z         PASS [   0.039s] ( 809/2562) spt-daemon failedaddr::tests::matches_the_exact_address_and_no_other
2026-08-17T23:40:43.9385442Z         PASS [   0.044s] ( 810/2562) spt-daemon firewall::tests::a_deny_line_naming_the_port_does_not_admit_it
2026-08-17T23:40:43.9429826Z         PASS [   0.042s] ( 811/2562) spt-daemon firewall::tests::a_disabled_manager_does_not_shadow_the_backend
2026-08-17T23:40:43.9467406Z         PASS [   0.042s] ( 812/2562) spt-daemon firewall::tests::a_live_manager_outranks_its_backend
2026-08-17T23:40:43.9510527Z         PASS [   0.214s] ( 813/2562) spt-daemon effect::tests::each_named_minter_namespaces_its_ops
2026-08-17T23:40:43.9516096Z         PASS [   0.042s] ( 814/2562) spt-daemon firewall::tests::active_but_unreadable_is_unverified_not_a_verdict
2026-08-17T23:40:43.9556479Z         PASS [   0.037s] ( 815/2562) spt-daemon firewall::tests::active_ufw_is_decided_against_the_bound_port
2026-08-17T23:40:43.9595780Z         PASS [   0.084s] ( 816/2562) spt::bin/spt api::startup::tests::seed_bind_records_seed_captured_cwd
2026-08-17T23:40:43.9610008Z         PASS [   0.036s] ( 817/2562) spt-daemon firewall::tests::any_rule_of_the_name_admitting_the_binder_passes
2026-08-17T23:40:43.9653125Z         PASS [   0.036s] ( 818/2562) spt-daemon firewall::tests::no_active_firewall_reads_unknown_and_inactive_ones_are_skipped
2026-08-17T23:40:43.9694075Z         PASS [   0.036s] ( 819/2562) spt-daemon firewall::tests::rule_for_another_binary_is_a_mismatch_not_a_pass
2026-08-17T23:40:43.9954117Z         PASS [   0.250s] ( 820/2562) spt-daemon effect::tests::gauntlet_is_exactly_once_across_brain_crashes
2026-08-17T23:40:43.9992694Z         PASS [   1.784s] ( 821/2562) spt-daemon brainproc::tests::exe_hash_computed_exactly_once_across_n_publishes
2026-08-17T23:40:44.0184450Z         PASS [   0.080s] ( 822/2562) spt-daemon firewall::tests::rule_for_the_binder_passes_regardless_of_case_or_separators
2026-08-17T23:40:44.0224391Z         PASS [   0.079s] ( 823/2562) spt-daemon firewall::tests::unanswerable_probes_read_unknown_and_no_rule_reads_missing
2026-08-17T23:40:44.0281522Z         PASS [   0.081s] ( 824/2562) spt-daemon forkop::tests::forking_into_the_reserved_id_is_refused_before_the_mind_is_copied
2026-08-17T23:40:44.0328527Z         PASS [   0.082s] ( 825/2562) spt-daemon frame::tests::envelope_with_unknown_trailing_field_decodes_on_older_peer
2026-08-17T23:40:44.0375936Z         PASS [   0.086s] ( 826/2562) spt-daemon frame::tests::handshake_accepts_newer_brain_on_older_broker
2026-08-17T23:40:44.0413478Z         PASS [   0.086s] ( 827/2562) spt-daemon frame::tests::handshake_rejects_below_floor
2026-08-17T23:40:44.0469897Z         PASS [   0.087s] ( 828/2562) spt::bin/spt api::startup::tests::seed_fail_eof_gives_actionable_stale_broker_hint
2026-08-17T23:40:44.0508957Z         PASS [   0.090s] ( 829/2562) spt-daemon frame::tests::handshake_rejects_role_mismatch
2026-08-17T23:40:44.0579826Z         PASS [   0.093s] ( 830/2562) spt-daemon frame::tests::unknown_kind_is_not_a_decode_error
2026-08-17T23:40:44.0615723Z         PASS [   0.092s] ( 831/2562) spt-daemon grants::tests::escalation_answers_apply
2026-08-17T23:40:44.0662196Z         PASS [   0.071s] ( 832/2562) spt-daemon grants::tests::escalation_ask_body_roundtrip
2026-08-17T23:40:44.0676182Z         PASS [   0.347s] ( 833/2562) spt-daemon drivehub::tests::the_pre_ack_causes_are_three_distinct_diagnostics
2026-08-17T23:40:44.0753372Z         PASS [   0.057s] ( 834/2562) spt-daemon grants::tests::no_session_escalates_with_none_target
2026-08-17T23:40:44.0802159Z         PASS [   0.058s] ( 835/2562) spt-daemon grants::tests::preconsent_flags_author_grants
2026-08-17T23:40:44.0861066Z         PASS [   0.058s] ( 836/2562) spt-daemon grants::tests::reserved_capabilities_refuse_even_when_granted
2026-08-17T23:40:44.0914778Z         PASS [   0.059s] ( 837/2562) spt-daemon grants::tests::ungranted_escalates_granted_allows
2026-08-17T23:40:44.0965709Z         PASS [   0.059s] ( 838/2562) spt-daemon harnesshost::tests::mint_session_id_is_fresh_hex
2026-08-17T23:40:44.1021246Z         PASS [   0.061s] ( 839/2562) spt-daemon harnesshost::tests::node_key_fills_advertised_label_in_session_template
2026-08-17T23:40:44.1072392Z         PASS [   0.060s] ( 840/2562) spt::bin/spt api::startup::tests::seed_restorable_spends_dead_seeds_restores_recoverable
2026-08-17T23:40:44.1119269Z         PASS [   0.061s] ( 841/2562) spt-daemon harnesshost::tests::node_missing_reference_fails_loud
2026-08-17T23:40:44.1188752Z         PASS [   0.061s] ( 842/2562) spt-daemon harnesshost::tests::prepare_fails_closed_on_wrong_kind_missing_role_and_bad_template
2026-08-17T23:40:44.1246966Z         PASS [   0.063s] ( 843/2562) spt-daemon harnesshost::tests::prepare_fills_env_inject_values_with_substitution
2026-08-17T23:40:44.1302333Z         PASS [   0.064s] ( 844/2562) spt-daemon harnesshost::tests::prepare_fills_id_and_session_into_self_command
2026-08-17T23:40:44.1385296Z         PASS [   0.071s] ( 845/2562) spt-daemon harnesshost::tests::prepare_resume_falls_back_to_self_when_no_resume_role
2026-08-17T23:40:44.1422734Z         PASS [   0.067s] ( 846/2562) spt-daemon harnesshost::tests::prepare_selects_resume_template_on_resume_else_self
2026-08-17T23:40:44.1504513Z         PASS [   0.070s] ( 847/2562) spt-daemon harnesshost::tests::prepare_threads_translation_binary_when_declared
2026-08-17T23:40:44.1549083Z         PASS [   0.069s] ( 848/2562) spt-daemon harnesshost::tests::provisional_session_id_recognizes_own_mint_only
2026-08-17T23:40:44.1607217Z         PASS [   0.069s] ( 849/2562) spt-daemon harnesshost::tests::translation_binary_resolves_against_install_dir
2026-08-17T23:40:44.2842128Z         PASS [   0.177s] ( 850/2562) spt::bin/spt api::startup::tests::session_id_fallback_binds_live_perch_from_sid
2026-08-17T23:40:44.3145725Z         PASS [   0.176s] ( 851/2562) spt-daemon lifecycle::tests::base_keys_carries_single_subnet_no_home
2026-08-17T23:40:44.3595181Z         PASS [   0.217s] ( 852/2562) spt-daemon lifecycle::tests::crash_signoff_spares_recovered_self
2026-08-17T23:40:44.3619806Z         PASS [   0.211s] ( 853/2562) spt-daemon lifecycle::tests::crash_signoff_tears_down_when_still_gone
2026-08-17T23:40:44.3635400Z         PASS [   0.364s] ( 854/2562) spt-daemon grants::tests::escalation_notif_fires_to_most_recent_and_roundtrips
2026-08-17T23:40:44.3640706Z         PASS [   0.252s] ( 855/2562) spt-daemon lifecycle::tests::a_seeded_ingest_fault_survives_a_turn_success_after_a_restart
2026-08-17T23:40:44.3799054Z         PASS [   0.016s] ( 856/2562) spt-daemon lifecycle::tests::first_turn_psyche_context_is_never_empty
2026-08-17T23:40:44.4818462Z         PASS [   0.351s] ( 857/2562) spt-daemon lifecycle::tests::any_kind_success_clears_timeouts_but_only_its_own_hard_counter
2026-08-17T23:40:44.4819111Z         PASS [   0.120s] ( 858/2562) spt-daemon lifecycle::tests::event_turn_bound_follows_the_role_not_the_pulse
2026-08-17T23:40:44.4819770Z         PASS [   0.198s] ( 859/2562) spt::bin/spt api::startup::tests::session_id_fallback_refuses_a_psyche_custody_sid
2026-08-17T23:40:44.4917928Z         PASS [   0.177s] ( 860/2562) spt-daemon lifecycle::tests::echo_fire_skips_loud_on_relative_dir_without_cwd
2026-08-17T23:40:44.4978386Z         PASS [   0.337s] ( 861/2562) spt-daemon lifecycle::tests::echo_fire_resolves_relative_commune_dir_against_endpoint_cwd
2026-08-17T23:40:44.4981191Z         PASS [   0.379s] ( 862/2562) spt-daemon lifecycle::tests::a_slotless_stamp_seeds_nothing_and_an_unknown_slot_is_ignored
2026-08-17T23:40:44.5017765Z         PASS [   0.347s] ( 863/2562) spt-daemon lifecycle::tests::custody_survives_parent_boundary_and_reseed_clears
2026-08-17T23:40:44.5148622Z         PASS [   0.151s] ( 864/2562) spt-daemon lifecycle::tests::harness_owner_gone_anchors_on_parent_pid
2026-08-17T23:40:44.5613763Z         PASS [   0.079s] ( 865/2562) spt-daemon lifecycle::tests::manifest_cell_refresh_swaps_manifest_and_runtime
2026-08-17T23:40:44.5640062Z         PASS [   0.184s] ( 866/2562) spt-daemon lifecycle::tests::ingest_hard_failures_stamp_even_while_turns_succeed
2026-08-17T23:40:44.5674455Z         PASS [   0.086s] ( 867/2562) spt-daemon lifecycle::tests::is_owlery_internal_cases
2026-08-17T23:40:44.5762807Z         PASS [   0.094s] ( 868/2562) spt::bin/spt api::startup::tests::session_id_fallback_refuses_empty_sid_and_dead_anchor
2026-08-17T23:40:44.5783006Z         PASS [   0.086s] ( 869/2562) spt-daemon lifecycle::tests::node_key_fills_advertised_label_in_lifecycle_base_keys
2026-08-17T23:40:44.5926971Z         PASS [   0.496s] ( 870/2562) spt-daemon inject::tests::has_parked_idle_spool_gates_on_idle_hosted_and_pending
2026-08-17T23:40:44.6015267Z         PASS [   0.099s] ( 871/2562) spt-daemon lifecycle::tests::outcome_classifies_by_type_never_by_message
2026-08-17T23:40:44.6030392Z         PASS [   0.105s] ( 872/2562) spt-daemon lifecycle::tests::orphan_watch_honors_stop_for_live_owner
2026-08-17T23:40:44.6059833Z         PASS [   0.091s] ( 873/2562) spt-daemon lifecycle::tests::outcome_names_its_leg_and_turn_failure_wins
2026-08-17T23:40:44.6086001Z         PASS [   0.506s] ( 874/2562) spt-daemon inject::tests::shared_inject_leg_detects_spt_hosted
2026-08-17T23:40:44.6170092Z         PASS [   0.053s] ( 875/2562) spt-daemon lifecycle::tests::psyche_turn_keys_carry_custody_sids_and_context_file_path
2026-08-17T23:40:44.6234122Z         PASS [   0.062s] ( 876/2562) spt-daemon lifecycle::tests::psyche_context_file_continue_is_zero_bytes_fresh_is_nonempty
2026-08-17T23:40:44.6234928Z         PASS [   0.056s] ( 877/2562) spt-daemon lifecycle::tests::psyche_turn_strikes_exhausted_boundary
2026-08-17T23:40:44.6355512Z         PASS [   0.059s] ( 878/2562) spt::bin/spt api::startup::tests::stale_seed_refusal_spends_the_seed_no_restore
2026-08-17T23:40:44.6674875Z         PASS [   0.169s] ( 879/2562) spt-daemon lifecycle::tests::orphan_watch_fires_on_dead_owner
2026-08-17T23:40:44.7249839Z         PASS [   0.132s] ( 880/2562) spt-daemon lifecycle::tests::pulse_loop_does_not_write_anchor_per_fire
2026-08-17T23:40:44.7340558Z         PASS [   0.133s] ( 881/2562) spt-daemon lifecycle::tests::pulse_loop_is_config_paced_and_killable
2026-08-17T23:40:44.7373062Z         PASS [   0.114s] ( 882/2562) spt-daemon lifecycle::tests::reload_keeps_last_good_on_unparseable
2026-08-17T23:40:44.7381593Z         PASS [   0.114s] ( 883/2562) spt-daemon lifecycle::tests::reload_fires_on_disk_change
2026-08-17T23:40:44.7382321Z         PASS [   0.102s] ( 884/2562) spt::bin/spt api::startup::tests::stale_seed_with_dead_anchor_refused
2026-08-17T23:40:44.7414612Z         PASS [   0.074s] ( 885/2562) spt-daemon lifecycle::tests::reload_noop_when_unchanged
2026-08-17T23:40:44.7459210Z         PASS [   0.021s] ( 886/2562) spt-daemon lifecycle::tests::reload_noop_without_install_dir
2026-08-17T23:40:44.7478040Z         PASS [   0.014s] ( 887/2562) spt-daemon lifecycle::tests::resolve_endpoint_drop_dir_cases
2026-08-17T23:40:44.7530730Z         PASS [   0.147s] ( 888/2562) spt-daemon lifecycle::tests::pulse_recency_and_auto_suspend_follow_resting_state
2026-08-17T23:40:44.7552434Z         PASS [   0.152s] ( 889/2562) spt-daemon lifecycle::tests::pulse_loop_update_preserves_phase_crash_rebases
2026-08-17T23:40:44.7825344Z         PASS [   1.198s] ( 890/2562) spt-daemon dispatch::tests::the_relay_observation_is_a_real_connect_and_a_gone_listener_never_reads_offline
2026-08-17T23:40:44.8180634Z         PASS [   0.072s] ( 891/2562) spt-daemon lifecycle::tests::session_not_found_discriminates_reseed_from_strike
2026-08-17T23:40:44.8393400Z         PASS [   0.260s] ( 892/2562) spt-daemon lifecycle::tests::psyche_turn_threads_parent_read_env_into_spawn
2026-08-17T23:40:44.8428422Z         PASS [   0.104s] ( 893/2562) spt::bin/spt api::startup::tests::successful_bind_consumes_the_seed_exactly_once
2026-08-17T23:40:44.9487175Z         PASS [   0.165s] ( 894/2562) spt-daemon lifecycle::tests::turn_budget_stamps_on_exhaustion_and_clears_on_success
2026-08-17T23:40:44.9570469Z         PASS [   0.220s] ( 895/2562) spt-daemon lifecycle::tests::rest_edge_echo_success_clears_stale_psyche_stamp
2026-08-17T23:40:44.9674461Z         PASS [   0.220s] ( 896/2562) spt-daemon lifecycle::tests::the_expectation_is_recorded_before_the_spawn_not_after
2026-08-17T23:40:44.9728064Z         PASS [   0.218s] ( 897/2562) spt-daemon lifecycle::tests::timeout_budget_is_ten_deep_not_three
2026-08-17T23:40:45.0149743Z         PASS [   0.176s] ( 898/2562) spt-daemon linkhost::tests::force_on_an_offline_instance_is_the_plain_relink
2026-08-17T23:40:45.0368963Z         PASS [   0.069s] ( 899/2562) spt-daemon linkhost::tests::per_capability_act_gate_blocks_until_class_scoped_grant
2026-08-17T23:40:45.0448693Z         PASS [   0.291s] ( 900/2562) spt-daemon lifecycle::tests::thrash_budget_trips_on_a_synthetic_failure_loop_without_touching_status
2026-08-17T23:40:45.0720042Z         PASS [   0.334s] ( 901/2562) spt-daemon lifecycle::tests::rest_event_fires_echo_once_and_wake_resurfaces
2026-08-17T23:40:45.0766606Z         PASS [   0.128s] ( 902/2562) spt-daemon linkhost::tests::force_refuses_an_ephemeral_instance_and_moves_nothing
2026-08-17T23:40:45.1176796Z         PASS [   0.300s] ( 903/2562) spt-daemon linkhost::tests::cmd_wakes_a_stale_online_persistent_instance
2026-08-17T23:40:45.1456640Z         PASS [   0.404s] ( 904/2562) spt-daemon lifecycle::tests::role_less_manifest_ticks_strike_free
2026-08-17T23:40:45.1733259Z         PASS [   0.129s] ( 905/2562) spt-daemon linkhost::tests::run_action_honors_the_force_arg
2026-08-17T23:40:45.1976003Z         PASS [   0.161s] ( 906/2562) spt-daemon linkhost::tests::run_action_drive_drops_offline_without_wake_or_spool
2026-08-17T23:40:45.2055240Z         PASS [   0.248s] ( 907/2562) spt-daemon linkhost::tests::gateway_typed_owner_resolves_and_drives_keyed_on_id_not_type
2026-08-17T23:40:45.2056336Z         PASS [   0.087s] ( 908/2562) spt-daemon linkhost::tests::survivor_probe_separates_our_binary_from_a_recycled_pid
2026-08-17T23:40:45.2144916Z         PASS [   0.069s] ( 909/2562) spt-daemon machineid::tests::hash_is_domain_separated_and_stable
2026-08-17T23:40:45.2145664Z         PASS [   0.200s] ( 910/2562) spt-daemon linkhost::tests::relink_refuses_a_live_instance_but_recovers_a_stale_online_one
2026-08-17T23:40:45.2230281Z         PASS [   0.250s] ( 911/2562) spt-daemon linkhost::tests::prepare_drive_is_live_or_drop_and_never_spools
2026-08-17T23:40:45.2298288Z         PASS [   0.032s] ( 912/2562) spt-daemon msg::tests::bytes_round_trip_through_payload
2026-08-17T23:40:45.2325025Z         PASS [   0.027s] ( 913/2562) spt-daemon msg::tests::endpoint_injected_envelope_carries_delivered_and_spool_hint
2026-08-17T23:40:45.2339131Z         PASS [   0.029s] ( 914/2562) spt-daemon msg::tests::endpoint_input_frames_round_trip
2026-08-17T23:40:45.2346016Z         PASS [   0.061s] ( 915/2562) spt-daemon machineid::tests::machine_id_hash_resolves_and_is_stable
2026-08-17T23:40:45.2378275Z         PASS [   0.023s] ( 916/2562) spt-daemon msg::tests::evicted_envelope_round_trips
2026-08-17T23:40:45.2398810Z         PASS [   0.025s] ( 917/2562) spt-daemon msg::tests::input_req_absent_ack_defaults_true_n_minus_1_safe
2026-08-17T23:40:45.2574826Z         PASS [   0.185s] ( 918/2562) spt-daemon linkhost::tests::run_action_refuses_gated_op_without_spooling
2026-08-17T23:40:45.2910578Z         PASS [   0.068s] ( 919/2562) spt-daemon msg::tests::input_req_ack_false_round_trips_faithfully
2026-08-17T23:40:45.2954055Z         PASS [   0.219s] ( 920/2562) spt-daemon linkhost::tests::run_action_relinks_drives_and_refuses
2026-08-17T23:40:45.3050050Z         PASS [   0.072s] ( 921/2562) spt-daemon msg::tests::output_envelope_round_trips
2026-08-17T23:40:45.3051268Z         PASS [   0.075s] ( 922/2562) spt-daemon msg::tests::net_frames_round_trip_and_tolerate_unknown_fields
2026-08-17T23:40:45.3130870Z         PASS [   0.079s] ( 923/2562) spt-daemon msg::tests::output_sync_flag_defaults_absent_and_skips_when_false
2026-08-17T23:40:45.3198234Z         PASS [   0.085s] ( 924/2562) spt-daemon msg::tests::presence_event_round_trips_and_tolerates_future_kind
2026-08-17T23:40:45.3226455Z         PASS [   0.017s] ( 925/2562) spt-daemon nethost::tests::begin_attach_refuses_only_while_a_poisoned_prior_still_drains
2026-08-17T23:40:45.3286105Z         PASS [   0.089s] ( 926/2562) spt-daemon msg::tests::stream_lifetime_is_additive_and_defaults_durable
2026-08-17T23:40:45.3341613Z         PASS [   0.077s] ( 927/2562) spt-daemon msg::tests::two_phase_join_wire_round_trips
2026-08-17T23:40:45.3390683Z         PASS [   0.048s] ( 928/2562) spt-daemon msg::tests::wire_decodes_old_shape_to_legacy
2026-08-17T23:40:45.3942891Z         PASS [   0.089s] ( 929/2562) spt-daemon nethost::tests::attach_replay_never_interleaves_with_concurrent_live_appends
2026-08-17T23:40:45.3953417Z         PASS [   0.100s] ( 930/2562) spt-daemon nethost::tests::append_halts_at_first_failed_write_removes_the_seat_and_cancels_the_lease
2026-08-17T23:40:45.4007533Z         PASS [   0.163s] ( 931/2562) spt-daemon msg::tests::spawn_req_tolerates_unknown_field
2026-08-17T23:40:45.4323818Z         PASS [   0.104s] ( 932/2562) spt-daemon nethost::tests::displaced_writer_failure_never_cancels_the_successor_lease
2026-08-17T23:40:45.4338897Z         PASS [   0.100s] ( 933/2562) spt-daemon nethost::tests::finish_halts_and_removes_a_poisoned_seat
2026-08-17T23:40:45.4344920Z         PASS [   0.095s] ( 934/2562) spt-daemon nethost::tests::home_relay_reads_a_real_serialized_endpoint_addr
2026-08-17T23:40:45.5158213Z         PASS [   0.193s] ( 935/2562) spt-daemon nethost::tests::dispatch_stream_infos_excludes_local_and_retired_rows_server_side
2026-08-17T23:40:45.5384774Z         PASS [   0.106s] ( 936/2562) spt-daemon nethost::tests::next_seq_counts_appends_not_logical_chunks
2026-08-17T23:40:45.5632194Z         PASS [   0.024s] ( 937/2562) spt-daemon nethost::tests::opener_pins_first_line_across_full_ring_roll
2026-08-17T23:40:45.5648478Z         PASS [   0.049s] ( 938/2562) spt-daemon nethost::tests::opener_capture_gives_up_bounded_on_a_newline_less_stream
2026-08-17T23:40:45.6047208Z         PASS [   0.209s] ( 939/2562) spt-daemon nethost::tests::loopback_conn_is_a_reused_singleton_that_cross_wires_a_stream_pair
2026-08-17T23:40:45.6235120Z         PASS [   0.229s] ( 940/2562) spt-daemon nethost::tests::host_binds_endpoint_to_node_identity
2026-08-17T23:40:45.6250191Z         PASS [   0.312s] ( 941/2562) spt-daemon nethost::tests::bounded_block_on_cuts_a_never_completing_op_with_an_ordinary_error
2026-08-17T23:40:45.6365005Z         PASS [   0.202s] ( 942/2562) spt-daemon nethost::tests::open_class_routes_to_the_opener_row_only
2026-08-17T23:40:45.6367407Z         PASS [   0.203s] ( 943/2562) spt-daemon nethost::tests::op_maps_are_minter_namespaced
2026-08-17T23:40:45.6482668Z         PASS [   0.085s] ( 944/2562) spt-daemon nethost::tests::overflow_detaches_without_lease_cancel_and_the_brain_resumes_from_cursor
2026-08-17T23:40:45.6558627Z         PASS [   0.051s] ( 945/2562) spt-daemon nethost::tests::retentive_log_is_lossless_ordered_while_ordinary_log_overwrites
2026-08-17T23:40:45.6573178Z         PASS [   0.093s] ( 946/2562) spt-daemon nethost::tests::presence_log_mirrors_the_seat_discipline
2026-08-17T23:40:45.6846778Z         PASS [   0.842s] ( 947/2562) spt::bin/spt api::startup::tests::the_escape_the_refusal_names_actually_clears_it
2026-08-17T23:40:45.7124048Z         PASS [   0.076s] ( 948/2562) spt-daemon nethost::tests::send_stream_refuses_on_a_canceled_lease
2026-08-17T23:40:45.7509389Z         PASS [   0.066s] ( 949/2562) spt::bin/spt api::startup::tests::the_pid_role_is_stamped_from_the_entry_path
2026-08-17T23:40:45.7715917Z         PASS [   0.146s] ( 950/2562) spt-daemon nethost::tests::retire_sweep_dismisses_the_seat_and_terminal_retire_drops_the_row
2026-08-17T23:40:45.7726256Z         PASS [   0.149s] ( 951/2562) spt-daemon nethost::tests::retire_hides_the_row_while_active_rows_stay
2026-08-17T23:40:45.7886087Z         PASS [   0.152s] ( 952/2562) spt-daemon nethost::tests::retired_row_still_flushes_a_late_reply
2026-08-17T23:40:45.7905099Z         PASS [   0.471s] ( 953/2562) spt-daemon nethost::tests::conn_close_sweeps_its_stream_rows
2026-08-17T23:40:45.7911029Z         PASS [   0.143s] ( 954/2562) spt-daemon nethost::tests::two_hosts_dial_over_loopback
2026-08-17T23:40:45.8339946Z         PASS [   0.178s] ( 955/2562) spt-daemon nethost::tests::unsubscribe_releases_only_the_callers_seat_joins_writer_and_is_idempotent
2026-08-17T23:40:45.9632893Z         PASS [   0.212s] ( 956/2562) spt::bin/spt api::startup::tests::valid_seed_binds_live_perch
2026-08-17T23:40:46.0908959Z         PASS [   1.966s] ( 957/2562) spt-daemon lifecycle::tests::an_ingest_consumes_the_standing_expectation
2026-08-17T23:40:46.1158893Z         PASS [   0.403s] ( 958/2562) spt-daemon notif::tests::expired_row_is_auto_dismissed_at_boundary_not_surfaced
2026-08-17T23:40:46.1237202Z         PASS [   0.332s] ( 959/2562) spt-daemon notif::tests::hidden_endpoint_boundary_surfaces_nothing
2026-08-17T23:40:46.1242284Z         PASS [   0.352s] ( 960/2562) spt-daemon notif::tests::first_fire_declines_an_already_expired_row
2026-08-17T23:40:46.1461402Z         PASS [   0.355s] ( 961/2562) spt-daemon notif::tests::first_fire_rides_the_quiet_window_not_the_live_stream
2026-08-17T23:40:46.1469020Z         PASS [   0.490s] ( 962/2562) spt-daemon notif::tests::consent_decision_produces_notif_only_when_gated
2026-08-17T23:40:46.1719106Z         PASS [   0.383s] ( 963/2562) spt-daemon notif::tests::first_fire_redirects_to_a_fresher_remote_winner_unmarked
2026-08-17T23:40:46.1743873Z         PASS [   0.340s] ( 964/2562) spt-daemon notif::tests::hidden_endpoint_is_never_the_target
2026-08-17T23:40:46.2063721Z         PASS [   0.434s] ( 965/2562) spt-daemon notif::tests::first_fire_reaches_most_recent_visible_endpoint
2026-08-17T23:40:46.2407706Z         PASS [   0.034s] ( 966/2562) spt-daemon notifgate::tests::distinct_notifs_both_deliver
2026-08-17T23:40:46.2413690Z         PASS [   0.067s] ( 967/2562) spt-daemon notifgate::tests::an_unvalidatable_notify_passes
2026-08-17T23:40:46.2424641Z         PASS [   0.152s] ( 968/2562) spt-daemon notif::tests::no_live_endpoint_is_a_typed_no_target
2026-08-17T23:40:46.2580301Z         PASS [   0.017s] ( 969/2562) spt-daemon notifgate::tests::retain_preserves_order_of_the_survivors
2026-08-17T23:40:46.2690331Z         PASS [   0.146s] ( 970/2562) spt-daemon notif::tests::notif_command_renders_all_keys_and_is_opt_in
2026-08-17T23:40:46.3016233Z         PASS [   0.060s] ( 971/2562) spt-daemon notifgate::tests::the_validity_gate_decision_table
2026-08-17T23:40:46.3442898Z         PASS [   0.228s] ( 972/2562) spt-daemon notif::tests::node_scoped_first_fire_ignores_a_fresher_remote_winner
2026-08-17T23:40:46.3921593Z         PASS [   0.245s] ( 973/2562) spt-daemon notif::tests::shell_notif_templates_render_for_attached_instances_only
2026-08-17T23:40:46.4015000Z         PASS [   2.042s] ( 974/2562) spt-daemon lifecycle::tests::empty_sweep_yields_no_outcome_while_a_real_ingest_yields_success
2026-08-17T23:40:46.4103924Z         PASS [   0.018s] ( 975/2562) spt-daemon pairhost::tests::a_re_postured_subnet_advises_and_never_applies
2026-08-17T23:40:46.4616405Z         PASS [   0.160s] ( 976/2562) spt-daemon notifsync::tests::non_member_subnet_record_never_materializes
2026-08-17T23:40:46.4695438Z         PASS [   0.227s] ( 977/2562) spt-daemon notifsync::tests::concurrent_dismiss_and_surface_commute_across_the_feed
2026-08-17T23:40:46.4756297Z         PASS [   0.065s] ( 978/2562) spt-daemon pairhost::tests::joiner_clock_render_shows_step_offset_and_state
2026-08-17T23:40:46.4768387Z         PASS [   0.208s] ( 979/2562) spt-daemon notifsync::tests::node_scoped_rows_are_excluded_from_the_feed
2026-08-17T23:40:46.4858210Z         PASS [   0.024s] ( 980/2562) spt-daemon pairhost::tests::meet_failure_detail_concise_vs_verbose
2026-08-17T23:40:46.4867206Z         PASS [   0.228s] ( 981/2562) spt-daemon notifsync::tests::feed_converges_two_stores_and_dismiss_replicates
2026-08-17T23:40:46.4982917Z         PASS [   0.029s] ( 982/2562) spt-daemon pairhost::tests::meet_final_retry_failing_surrenders_once
2026-08-17T23:40:46.5005657Z         PASS [   0.025s] ( 983/2562) spt-daemon pairhost::tests::meet_retries_once_after_refresh_on_exhaustion
2026-08-17T23:40:46.5021056Z         PASS [   0.025s] ( 984/2562) spt-daemon pairhost::tests::the_advisory_says_nothing_was_applied
2026-08-17T23:40:46.5155388Z         PASS [   0.171s] ( 985/2562) spt-daemon notifsync::tests::untrusted_and_cross_subnet_origins_are_dropped
2026-08-17T23:40:46.5395707Z         PASS [   0.138s] ( 986/2562) spt-daemon pairhost::tests::an_advisory_records_the_sighting_and_still_applies_nothing
2026-08-17T23:40:46.5431988Z         PASS [   0.371s] ( 987/2562) spt-daemon notif::tests::suppression_window_holds_cross_endpoint
2026-08-17T23:40:46.5526103Z         PASS [   0.406s] ( 988/2562) spt-daemon notif::tests::rollback_notif_is_loud_and_resurfaces
2026-08-17T23:40:46.5531438Z         PASS [   0.067s] ( 989/2562) spt-daemon pairhost::tests::wire_errors_classify_for_the_guided_ux
2026-08-17T23:40:46.5738211Z         PASS [   0.450s] ( 990/2562) spt-daemon notif::tests::resurface_delivers_undismissed_with_gates
2026-08-17T23:40:46.5794595Z         PASS [   0.079s] ( 991/2562) spt-daemon presence::tests::snapshot_loading_degrades_on_junk
2026-08-17T23:40:46.5824980Z         PASS [   0.096s] ( 992/2562) spt-daemon presence::tests::mra_degrades_to_local_and_skips_noise_rows
2026-08-17T23:40:46.6144941Z         PASS [   0.116s] ( 993/2562) spt-daemon presence::tests::mra_joins_local_and_gossiped_legs_under_one_max
2026-08-17T23:40:46.6176773Z         PASS [   0.078s] ( 994/2562) spt-daemon projwriter::tests::cold_construct_spawns_no_git_and_first_cycle_publishes
2026-08-17T23:40:46.6192827Z         PASS [   2.011s] ( 995/2562) spt-daemon lifecycle::tests::pulse_tick_ingests_drop
2026-08-17T23:40:46.6274840Z         PASS [   0.125s] ( 996/2562) spt-daemon presence::tests::subnet_scope_gates_both_legs
2026-08-17T23:40:46.6279898Z         PASS [   0.085s] ( 997/2562) spt-daemon projwriter::tests::corrupt_index_is_repaired_and_counted
2026-08-17T23:40:46.6353997Z         PASS [   1.235s] ( 998/2562) spt-daemon nethost::tests::loopback_tunnel_backpressures_without_loss
2026-08-17T23:40:46.7021241Z         PASS [   0.083s] ( 999/2562) spt-daemon propagate::tests::classifier_maps_every_status_shape
2026-08-17T23:40:47.0759313Z         PASS [   0.448s] (1000/2562) spt-daemon psyrelay::tests::empty_and_oversize_bodies_drop_typed
2026-08-17T23:40:47.0958605Z         PASS [   0.394s] (1001/2562) spt-daemon psyrelay::tests::null_stdout_driver_fails_the_guard
2026-08-17T23:40:47.1217741Z         PASS [   0.486s] (1002/2562) spt-daemon psyrelay::tests::notify_without_live_endpoint_is_pending
2026-08-17T23:40:47.1218436Z         PASS [   0.494s] (1003/2562) spt-daemon psyrelay::tests::notify_reaches_own_user_only
2026-08-17T23:40:47.1252141Z         PASS [   0.573s] (1004/2562) spt-daemon projwriter::tests::cwd_invalidation_evicts_shared_cache_entry
2026-08-17T23:40:47.1539390Z         PASS [   0.029s] (1005/2562) spt-daemon pump::health::tests::a_failing_peer_whose_node_the_registry_reports_offline_reads_absent_not_degraded
2026-08-17T23:40:47.1733687Z         PASS [   0.019s] (1006/2562) spt-daemon pump::health::tests::a_non_target_connection_never_counts_and_disconnects_mirror_the_conn_set
2026-08-17T23:40:47.1932401Z         PASS [   0.020s] (1007/2562) spt-daemon pump::health::tests::a_subnet_leave_re_derives_the_live_count_without_disconnecting_anybody
2026-08-17T23:40:47.2091206Z         PASS [   0.016s] (1008/2562) spt-daemon pump::health::tests::a_target_leaving_the_roster_drops_its_failure_and_can_return_the_node_to_green
2026-08-17T23:40:47.2588689Z         PASS [   0.183s] (1009/2562) spt-daemon psyrelay::tests::prose_only_relays_nothing
2026-08-17T23:40:47.2836958Z         PASS [   0.074s] (1010/2562) spt-daemon pump::health::tests::degraded_on_all_peer_failure_healthy_only_on_real_progress
2026-08-17T23:40:47.2931145Z         PASS [   0.034s] (1011/2562) spt-daemon pump::health::tests::five_of_seven_failing_behind_two_live_peers_is_degraded_partial_never_healthy
2026-08-17T23:40:47.3105344Z         PASS [   0.017s] (1012/2562) spt-daemon pump::health::tests::one_peer_reconnecting_narrows_the_verdict_without_restarting_the_incident_clock
2026-08-17T23:40:47.3223970Z         PASS [   0.039s] (1013/2562) spt-daemon pump::health::tests::health_file_roundtrip_and_degrade
2026-08-17T23:40:47.3376178Z         PASS [   0.027s] (1014/2562) spt-daemon pump::health::tests::one_unaccounted_failing_peer_holds_the_degraded_partial_verdict
2026-08-17T23:40:47.3522918Z         PASS [   0.030s] (1015/2562) spt-daemon pump::health::tests::peers_absent_replaces_only_a_degraded_verdict_and_never_outlives_its_target
2026-08-17T23:40:47.3797348Z         PASS [   0.027s] (1016/2562) spt-daemon pump::health::tests::stage_parses_from_attributed_reasons
2026-08-17T23:40:47.3805230Z         PASS [   0.043s] (1017/2562) spt-daemon pump::health::tests::registry_admit_stamp_survives_restart_rounds_and_never_regresses
2026-08-17T23:40:47.3849023Z         PASS [   0.263s] (1018/2562) spt-daemon psyrelay::tests::reply_without_target_is_dropped
2026-08-17T23:40:47.4027974Z         PASS [   0.307s] (1019/2562) spt-daemon psyrelay::tests::reply_relays_to_inbound_sender
2026-08-17T23:40:47.4339031Z         PASS [   0.054s] (1020/2562) spt-daemon pump::health::tests::stale_gossip_forces_the_conservative_read_even_with_every_node_offline
2026-08-17T23:40:47.4464921Z         PASS [   0.066s] (1021/2562) spt-daemon pump::registry::tests::disclosable_lines_keeps_the_per_subnet_filter
2026-08-17T23:40:47.4731763Z         PASS [   0.027s] (1022/2562) spt-daemon pump::registry::tests::poll_wake_takes_the_advertise_marker_exactly_once
2026-08-17T23:40:47.4776053Z         FAIL [   0.071s] (1023/2562) spt-daemon pump::registry::tests::discover_gate_filters_the_advert_push_per_viewer
2026-08-17T23:40:47.4780549Z   stdout ───
2026-08-17T23:40:47.4780732Z 
2026-08-17T23:40:47.4780811Z     running 1 test
2026-08-17T23:40:47.4781199Z     test pump::registry::tests::discover_gate_filters_the_advert_push_per_viewer ... FAILED
2026-08-17T23:40:47.4781554Z 
2026-08-17T23:40:47.4781623Z     failures:
2026-08-17T23:40:47.4781729Z 
2026-08-17T23:40:47.4781793Z     failures:
2026-08-17T23:40:47.4782082Z         pump::registry::tests::discover_gate_filters_the_advert_push_per_viewer
2026-08-17T23:40:47.4782386Z 
2026-08-17T23:40:47.4782600Z     test result: FAILED. 0 passed; 1 failed; 0 ignored; 0 measured; 834 filtered out; finished in 0.02s
2026-08-17T23:40:47.4782848Z 
2026-08-17T23:40:47.4782955Z   stderr ───
2026-08-17T23:40:47.4783025Z 
2026-08-17T23:40:47.4783333Z     thread 'pump::registry::tests::discover_gate_filters_the_advert_push_per_viewer' (17524) panicked at crates\spt-daemon\src\pump\registry.rs:369:13:
2026-08-17T23:40:47.4784012Z     refused viewer is not told the endpoint exists: {"subnet":"home","endpoint_id":"ling","instance":{"node":"me","status":"Active","epoch":1,"resources":"ling builds rust","bound":true}}
2026-08-17T23:40:47.4784882Z     {"subnet":"home","endpoint_id":"doyle","instance":{"node":"me","status":"Active","epoch":1,"resources":"doyle builds rust","bound":true}}
2026-08-17T23:40:47.4785294Z     {"subnet":"home","node":"me","label":"hfenduleam","epoch":1}
2026-08-17T23:40:47.4785460Z 
2026-08-17T23:40:47.4785590Z     note: run with `RUST_BACKTRACE=1` environment variable to display a backtrace
2026-08-17T23:40:47.4785774Z 
2026-08-17T23:40:47.4785863Z   Cancelling due to test failure: 15 tests still running
2026-08-17T23:40:47.4856013Z         PASS [   0.364s] (1024/2562) spt-daemon psyrelay::tests::spoofed_routing_is_stripped_and_restamped
2026-08-17T23:40:47.4870254Z         PASS [   0.102s] (1025/2562) spt-daemon pump::registry::tests::disclosable_lines_pushes_the_engine_room_only_to_its_chosen_viewer
2026-08-17T23:40:47.5286012Z         PASS [   0.095s] (1026/2562) spt-daemon pump::registry::tests::fire_due_rotations_rotates_due_and_leaves_pending
2026-08-17T23:40:47.5950552Z         PASS [   0.122s] (1027/2562) spt-daemon pump::registry::tests::pre_round_sweeps_and_refreshes_adverts_each_round
2026-08-17T23:40:47.6171531Z         PASS [   1.038s] (1028/2562) spt-daemon projwriter::tests::ordinary_commit_is_noop_config_change_rederives
2026-08-17T23:40:47.6359949Z         PASS [   1.673s] (1029/2562) spt::bin/spt rc::tests::attach_viewport_reconnects_across_a_broker_bounce
2026-08-17T23:40:47.7105407Z         PASS [   1.093s] (1030/2562) spt-daemon projwriter::tests::writer_thread_debounces_burst_into_one_cycle
2026-08-17T23:40:48.2131714Z         PASS [   3.596s] (1031/2562) spt-daemon lifecycle::tests::relative_commune_dir_resolves_against_endpoint_cwd_and_fills_project_branch
2026-08-17T23:40:48.2233392Z         PASS [   1.649s] (1032/2562) spt-daemon projwriter::tests::failed_cycle_preserves_last_known_good
2026-08-17T23:40:48.2598321Z         PASS [   1.707s] (1033/2562) spt-daemon projwriter::tests::endpoint_events_patch_rows_and_drop_purged
2026-08-17T23:40:48.3041424Z         PASS [   1.690s] (1034/2562) spt-daemon projwriter::tests::warm_start_unchanged_generation_scans_nothing
2026-08-17T23:40:49.3996340Z         PASS [   2.884s] (1035/2562) spt-daemon projwriter::tests::batched_complexity_counters_hold
2026-08-17T23:40:50.0015334Z         PASS [   3.419s] (1036/2562) spt-daemon projwriter::tests::parity_full_ordered_list_vs_legacy_oracle
2026-08-17T23:40:50.5364866Z         PASS [  11.755s] (1037/2562) spt::bin/spt cli::tests::shell_spawn_gates_on_the_registered_set
2026-08-17T23:40:55.3445300Z         PASS [  16.966s] (1038/2562) spt::bin/spt cli::tests::owner_shutdown_gated_by_can_shutdown_grant
2026-08-17T23:40:55.3448076Z ────────────
2026-08-17T23:40:55.3449217Z      Summary [  22.310s] 1038/2562 tests run: 1037 passed (4 leaky), 1 failed, 1 skipped
2026-08-17T23:40:55.3450409Z         FAIL [   0.071s] (1023/2562) spt-daemon pump::registry::tests::discover_gate_filters_the_advert_push_per_viewer
2026-08-17T23:40:55.3451880Z warning: 1524/2562 tests were not run due to test failure (run with --no-fail-fast to run all tests, or run with --max-fail)
2026-08-17T23:40:55.3508396Z error: test run failed
2026-08-17T23:41:00.4618721Z ##[error]Process completed with exit code 1.
2026-08-17T23:41:00.4997783Z Post job cleanup.
2026-08-17T23:41:00.7328054Z [command]"C:\Program Files\Git\cmd\git.exe" version
2026-08-17T23:41:00.7544664Z git version 2.43.0.windows.1
2026-08-17T23:41:00.7575997Z Copying 'C:\Users\decid\.gitconfig' to 'C:\actions-runner\_work\_temp\1c8d9a75-60a8-459e-b00b-a65d86102adb\.gitconfig'
2026-08-17T23:41:00.7590620Z Temporarily overriding HOME='C:\actions-runner\_work\_temp\1c8d9a75-60a8-459e-b00b-a65d86102adb' before making global git config changes
2026-08-17T23:41:00.7591164Z Adding repository directory to the temporary git global config as a safe directory
2026-08-17T23:41:00.7595980Z [command]"C:\Program Files\Git\cmd\git.exe" config --global --add safe.directory C:\actions-runner\_work\spt-bs-core\spt-bs-core
2026-08-17T23:41:00.7838323Z [command]"C:\Program Files\Git\cmd\git.exe" config --local --name-only --get-regexp core\.sshCommand
2026-08-17T23:41:00.8075494Z [command]"C:\Program Files\Git\cmd\git.exe" submodule foreach --recursive "sh -c \"git config --local --name-only --get-regexp 'core\.sshCommand' && git config --local --unset-all 'core.sshCommand' || :\""
2026-08-17T23:41:01.3053043Z [command]"C:\Program Files\Git\cmd\git.exe" config --local --name-only --get-regexp http\.https\:\/\/github\.com\/\.extraheader
2026-08-17T23:41:01.3282750Z http.https://github.com/.extraheader
2026-08-17T23:41:01.3310133Z [command]"C:\Program Files\Git\cmd\git.exe" config --local --unset-all http.https://github.com/.extraheader
2026-08-17T23:41:01.3564813Z [command]"C:\Program Files\Git\cmd\git.exe" submodule foreach --recursive "sh -c \"git config --local --name-only --get-regexp 'http\.https\:\/\/github\.com\/\.extraheader' && git config --local --unset-all 'http.https://github.com/.extraheader' || :\""
2026-08-17T23:41:01.7999931Z [command]"C:\Program Files\Git\cmd\git.exe" config --local --name-only --get-regexp ^includeIf\.gitdir:
2026-08-17T23:41:01.8570351Z [command]"C:\Program Files\Git\cmd\git.exe" submodule foreach --recursive "git config --local --show-origin --name-only --get-regexp remote.origin.url"
2026-08-17T23:41:02.2936380Z Cleaning up orphan processes
2026-08-17T23:41:02.3387744Z Terminate orphan process: pid (38724) (PING)
2026-08-17T23:41:02.3447437Z Terminate orphan process: pid (47764) (PING)
2026-08-17T23:41:02.3505294Z Terminate orphan process: pid (41608) (PING)
2026-08-17T23:41:02.3549199Z Terminate orphan process: pid (43576) (PING)
